ACCESSION: MSBNK-GL_Sciences_Inc-GLS00010
RECORD_TITLE: L-Asparagine; EI-B; MS; 3 TMS; RT: 674.70 s
DATE: 2016.01.19 (Created 2012.08.03, modified 2013.07.31)
AUTHORS: Miyagawa H, Akimoto S, Yamasaki K, GL Sciences Inc.
LICENSE: CC BY-SA
COPYRIGHT: GL Sciences Inc.
COMMENT: The chemical compound was chemically modified with N-methyl-N-trimethylsilyl-trifluoroacetamide(MSTFA) before GC-MS analysis. When it has two or more functional groups, this modification gave a mixture of the TMS derivatives having different number of TMS groups at different functional groups.

CH$NAME: L-Asparagine
CH$COMPOUND_CLASS: Natural Product
CH$FORMULA: C4H8N2O3
CH$EXACT_MASS: 132.05349
CH$SMILES: NC(=O)C[C@@H](N)C(O)=O
CH$IUPAC: InChI=1S/C4H8N2O3/c5-2(4(8)9)1-3(6)7/h2H,1,5H2,(H2,6,7)(H,8,9)/t2-/m0/s1
CH$LINK: CAS 70-47-3
CH$LINK: CHEBI 17196
CH$LINK: KEGG C00152
CH$LINK: PUBCHEM 3452
CH$LINK: INCHIKEY DCXYFEDJOCDNAF-REOHCLBHSA-N
CH$LINK: COMPTOX DTXSID10883220

AC$INSTRUMENT: GCMS-2010 Plus, Shimadzu
AC$INSTRUMENT_TYPE: EI-B
AC$MASS_SPECTROMETRY: MS_TYPE MS
AC$MASS_SPECTROMETRY: ION_MODE POSITIVE
AC$MASS_SPECTROMETRY: GAS_PRESSURE 75 kPa
AC$MASS_SPECTROMETRY: ION_SOURCE_TEMPERATURE 200 C
AC$MASS_SPECTROMETRY: SCAN_RANGE_M/Z 85-500
AC$CHROMATOGRAPHY: COLUMN_NAME InertCap 5MS/NP 0.25 mmI.D. x 30 m, df=0.25 um
AC$CHROMATOGRAPHY: INJECTION_TEMPERATURE 230 C
AC$CHROMATOGRAPHY: OVEN_TEMPERATURE 80 C(2 min)-15 C/min - 330C
AC$CHROMATOGRAPHY: RETENTION_INDEX 1684
AC$CHROMATOGRAPHY: RETENTION_TIME 674.70
AC$CHROMATOGRAPHY: TRANSFARLINE_TEMPERATURE 250 C

MS$FOCUSED_ION: DERIVATIVE_TYPE 3 TMS
MS$DATA_PROCESSING: WHOLE GCMSsolution

PK$SPLASH: splash10-00lr-0930000000-79a089d9875e092dd7f2
PK$NUM_PEAK: 366
PK$PEAK: m/z int. rel.int.
  86.050000 7846.000000 13
  87.050000 3666.000000 6
  88.050000 2139.000000 3
  89.050000 3165.000000 5
  90.100000 10652.000000 17
  91.050000 2652.000000 4
  92.100000 807.000000 1
  93.100000 545.000000 1
  94.100000 214.000000 1
  95.100000 705.000000 1
  96.100000 876.000000 1
  97.050000 975.000000 2
  98.050000 6831.000000 11
  99.150000 3884.000000 6
  100.050000 104625.000000 168
  101.100000 13564.000000 22
  102.100000 10068.000000 16
  103.050000 10104.000000 16
  104.000000 1638.000000 3
  105.050000 1970.000000 3
  106.100000 433.000000 1
  107.100000 202.000000 1
  108.100000 194.000000 1
  109.100000 233.000000 1
  110.100000 642.000000 1
  111.100000 583.000000 1
  112.050000 1096.000000 2
  113.100000 2951.000000 5
  114.100000 34746.000000 56
  115.100000 36577.000000 59
  116.100000 620756.000000 999
  117.100000 79359.000000 128
  118.100000 29998.000000 48
  119.100000 5265.000000 8
  120.100000 553.000000 1
  121.100000 423.000000 1
  122.100000 103.000000 1
  123.100000 121.000000 1
  124.100000 490.000000 1
  125.100000 8545.000000 14
  126.100000 2238.000000 4
  127.100000 2012.000000 3
  128.100000 22383.000000 36
  129.100000 8588.000000 14
  130.100000 22882.000000 37
  131.100000 90396.000000 145
  132.100000 316354.000000 509
  133.100000 63180.000000 102
  134.100000 16660.000000 27
  135.050000 4126.000000 7
  136.100000 462.000000 1
  137.100000 204.000000 1
  138.100000 130.000000 1
  139.100000 894.000000 1
  140.150000 3796.000000 6
  141.100000 192154.000000 309
  142.100000 33244.000000 54
  143.100000 13502.000000 22
  144.100000 17721.000000 29
  145.100000 2967.000000 5
  146.150000 8015.000000 13
  147.100000 168833.000000 272
  148.100000 29593.000000 48
  149.100000 21762.000000 35
  150.100000 2310.000000 4
  151.050000 1076.000000 2
  152.100000 196.000000 1
  153.100000 2023.000000 3
  154.100000 2754.000000 4
  155.100000 497.000000 1
  156.100000 1542.000000 2
  157.150000 1337.000000 2
  158.100000 4561.000000 7
  159.100000 63385.000000 102
  160.100000 9871.000000 16
  161.100000 4113.000000 7
  162.100000 868.000000 1
  163.100000 4663.000000 8
  164.100000 1001.000000 2
  165.100000 418.000000 1
  166.100000 276.000000 1
  167.100000 292.000000 1
  168.100000 630.000000 1
  169.100000 15055.000000 24
  170.100000 3730.000000 6
  171.050000 1785.000000 3
  172.100000 19930.000000 32
  173.100000 4292.000000 7
  174.050000 9029.000000 15
  175.050000 1651.000000 3
  176.050000 1782.000000 3
  177.100000 1001.000000 2
  178.100000 399.000000 1
  179.100000 514.000000 1
  180.100000 113.000000 1
  181.100000 122.000000 1
  182.100000 254.000000 1
  183.100000 204.000000 1
  184.100000 631.000000 1
  185.100000 442.000000 1
  186.050000 1631.000000 3
  187.150000 3023.000000 5
  188.100000 250748.000000 404
  189.050000 46531.000000 75
  190.100000 37566.000000 60
  191.000000 6658.000000 11
  192.050000 1757.000000 3
  193.000000 551.000000 1
  194.000000 210.000000 1
  195.000000 129.000000 1
  196.000000 129.000000 1
  197.000000 538.000000 1
  198.050000 906.000000 1
  199.050000 4353.000000 7
  200.050000 2207.000000 4
  201.050000 2365.000000 4
  202.050000 68508.000000 110
  203.050000 16369.000000 26
  204.100000 20396.000000 33
  205.100000 4420.000000 7
  206.050000 4434.000000 7
  207.000000 2020.000000 3
  208.000000 479.000000 1
  209.000000 388.000000 1
  210.000000 119.000000 1
  211.000000 172.000000 1
  212.100000 124.000000 1
  213.100000 5007.000000 8
  214.050000 5953.000000 10
  215.100000 26353.000000 42
  216.100000 21134.000000 34
  217.150000 8538.000000 14
  218.050000 76541.000000 123
  219.050000 16281.000000 26
  220.050000 7470.000000 12
  221.100000 2500.000000 4
  222.100000 754.000000 1
  223.100000 369.000000 1
  224.100000 55.000000 1
  225.100000 266.000000 1
  226.100000 257.000000 1
  227.100000 916.000000 1
  228.050000 1495.000000 2
  229.100000 5567.000000 9
  230.150000 8341.000000 13
  231.100000 432431.000000 696
  232.100000 95809.000000 154
  233.100000 40030.000000 64
  234.100000 5988.000000 10
  235.050000 1295.000000 2
  236.100000 134.000000 1
  237.100000 57.000000 1
  238.100000 103.000000 1
  239.100000 108.000000 1
  240.100000 158.000000 1
  241.100000 1290.000000 2
  242.100000 6367.000000 10
  243.100000 25319.000000 41
  244.100000 11738.000000 19
  245.050000 4873.000000 8
  246.100000 1810.000000 3
  247.100000 500.000000 1
  248.100000 183.000000 1
  249.100000 46.000000 1
  250.100000 49.000000 1
  252.100000 27.000000 1
  253.100000 150.000000 1
  255.100000 79.000000 1
  256.100000 247.000000 1
  257.150000 1031.000000 2
  258.100000 87662.000000 141
  259.100000 23895.000000 38
  260.100000 9567.000000 15
  261.100000 2127.000000 3
  262.100000 6353.000000 10
  263.000000 1625.000000 3
  264.100000 1074.000000 2
  265.100000 156.000000 1
  266.100000 68.000000 1
  267.100000 36.000000 1
  268.100000 68.000000 1
  269.100000 34.000000 1
  270.100000 79.000000 1
  271.100000 36.000000 1
  272.100000 47.000000 1
  273.100000 188.000000 1
  274.100000 198.000000 1
  275.100000 282.000000 1
  276.100000 468.000000 1
  277.100000 479.000000 1
  278.100000 342.000000 1
  279.100000 508.000000 1
  280.100000 121.000000 1
  281.100000 358.000000 1
  282.100000 86.000000 1
  283.100000 121.000000 1
  284.100000 60.000000 1
  285.100000 81.000000 1
  286.100000 65.000000 1
  287.100000 142.000000 1
  288.100000 270.000000 1
  289.100000 290.000000 1
  290.100000 425.000000 1
  291.100000 282.000000 1
  292.100000 2769.000000 4
  292.900000 658.000000 1
  293.950000 1429.000000 2
  294.900000 166.000000 1
  295.900000 102.000000 1
  297.900000 138.000000 1
  298.900000 21.000000 1
  299.900000 145.000000 1
  300.900000 121.000000 1
  301.900000 238.000000 1
  302.900000 642.000000 1
  303.900000 361.000000 1
  305.200000 1788.000000 3
  306.000000 601.000000 1
  306.950000 2410.000000 4
  308.000000 367.000000 1
  309.000000 3238.000000 5
  310.000000 282.000000 1
  311.000000 108.000000 1
  312.000000 174.000000 1
  313.000000 58.000000 1
  314.000000 18.000000 1
  315.100000 495.000000 1
  316.100000 15132.000000 24
  317.100000 3975.000000 6
  318.100000 2010.000000 3
  319.100000 412.000000 1
  320.100000 180.000000 1
  321.100000 55.000000 1
  322.100000 31.000000 1
  327.100000 63.000000 1
  328.100000 146.000000 1
  329.100000 164.000000 1
  330.100000 198.000000 1
  331.150000 1657.000000 3
  332.250000 1189.000000 2
  333.150000 26070.000000 42
  334.100000 8546.000000 14
  335.200000 4242.000000 7
  336.200000 750.000000 1
  337.200000 202.000000 1
  338.200000 135.000000 1
  339.200000 71.000000 1
  341.200000 34.000000 1
  343.200000 54.000000 1
  344.200000 73.000000 1
  345.200000 50.000000 1
  346.200000 132.000000 1
  347.200000 529.000000 1
  348.200000 28858.000000 46
  349.150000 9634.000000 16
  350.150000 4105.000000 7
  351.050000 736.000000 1
  352.100000 294.000000 1
  353.100000 97.000000 1
  354.100000 22.000000 1
  355.100000 19.000000 1
  356.100000 47.000000 1
  357.100000 49.000000 1
  358.100000 27.000000 1
  359.100000 78.000000 1
  360.100000 47.000000 1
  361.100000 6.000000 1
  362.100000 94.000000 1
  363.100000 21.000000 1
  364.100000 92.000000 1
  365.100000 52.000000 1
  368.100000 30.000000 1
  370.100000 30.000000 1
  371.100000 49.000000 1
  372.100000 39.000000 1
  374.100000 55.000000 1
  375.100000 21.000000 1
  376.100000 30.000000 1
  377.100000 94.000000 1
  380.100000 3.000000 1
  382.100000 33.000000 1
  383.100000 3.000000 1
  386.100000 13.000000 1
  388.100000 14.000000 1
  389.100000 39.000000 1
  390.100000 127.000000 1
  393.100000 121.000000 1
  394.100000 122.000000 1
  396.100000 16.000000 1
  398.100000 38.000000 1
  399.100000 62.000000 1
  400.100000 30.000000 1
  401.100000 54.000000 1
  403.100000 137.000000 1
  404.100000 79.000000 1
  405.100000 279.000000 1
  406.100000 172.000000 1
  408.100000 50.000000 1
  409.100000 34.000000 1
  410.100000 124.000000 1
  411.100000 26.000000 1
  412.100000 22.000000 1
  413.100000 47.000000 1
  414.100000 145.000000 1
  415.100000 70.000000 1
  417.100000 46.000000 1
  418.100000 41.000000 1
  419.100000 82.000000 1
  420.100000 137.000000 1
  421.100000 470.000000 1
  422.100000 142.000000 1
  423.100000 132.000000 1
  424.100000 82.000000 1
  425.100000 108.000000 1
  427.100000 46.000000 1
  429.100000 18.000000 1
  430.100000 6.000000 1
  431.100000 124.000000 1
  432.100000 66.000000 1
  433.100000 63.000000 1
  434.100000 65.000000 1
  435.100000 24.000000 1
  438.100000 34.000000 1
  439.100000 34.000000 1
  441.100000 76.000000 1
  442.100000 38.000000 1
  444.100000 31.000000 1
  445.100000 46.000000 1
  446.100000 79.000000 1
  449.100000 73.000000 1
  450.100000 19.000000 1
  451.100000 57.000000 1
  452.100000 42.000000 1
  453.100000 49.000000 1
  454.100000 79.000000 1
  457.100000 58.000000 1
  458.100000 121.000000 1
  459.100000 19.000000 1
  460.100000 62.000000 1
  462.100000 38.000000 1
  465.100000 74.000000 1
  466.100000 38.000000 1
  468.100000 81.000000 1
  469.100000 63.000000 1
  474.100000 41.000000 1
  475.100000 14.000000 1
  476.100000 118.000000 1
  477.100000 30.000000 1
  478.100000 10.000000 1
  479.100000 55.000000 1
  481.100000 38.000000 1
  482.100000 26.000000 1
  483.100000 89.000000 1
  486.100000 52.000000 1
  487.100000 103.000000 1
  488.100000 58.000000 1
  489.100000 5.000000 1
  490.100000 39.000000 1
  491.100000 26.000000 1
  492.100000 22.000000 1
  493.100000 2.000000 1
  494.100000 18.000000 1
  495.100000 111.000000 1
  496.100000 70.000000 1
  498.100000 34.000000 1
  499.100000 44.000000 1