ACCESSION: MSBNK-GL_Sciences_Inc-GLS00055
RECORD_TITLE: GABA; EI-B; MS; 3 TMS; RT: 602.93 s
DATE: 2016.01.19 (Created 2012.08.03, modified 2013.07.31)
AUTHORS: Miyagawa H, Akimoto S, Yamasaki K, GL Sciences Inc.
LICENSE: CC BY-SA
COPYRIGHT: GL Sciences Inc.
COMMENT: The chemical compound was chemically modified with N-methyl-N-trimethylsilyl-trifluoroacetamide(MSTFA) before GC-MS analysis. When it has two or more functional groups, this modification gave a mixture of the TMS derivatives having different number of TMS groups at different functional groups.

CH$NAME: GABA
CH$NAME: 4-Aminobutyric acid
CH$COMPOUND_CLASS: Natural Product
CH$FORMULA: C4H9NO2
CH$EXACT_MASS: 103.06333
CH$SMILES: NCCCC(O)=O
CH$IUPAC: InChI=1S/C4H9NO2/c5-3-1-2-4(6)7/h1-3,5H2,(H,6,7)
CH$LINK: CAS 56-12-2
CH$LINK: CHEBI 16865
CH$LINK: KEGG C00334
CH$LINK: PUBCHEM 3628
CH$LINK: INCHIKEY BTCSSZJGUNDROE-UHFFFAOYSA-N
CH$LINK: COMPTOX DTXSID6035106

AC$INSTRUMENT: GCMS-2010 Plus, Shimadzu
AC$INSTRUMENT_TYPE: EI-B
AC$MASS_SPECTROMETRY: MS_TYPE MS
AC$MASS_SPECTROMETRY: ION_MODE POSITIVE
AC$MASS_SPECTROMETRY: GAS_PRESSURE 75 kPa
AC$MASS_SPECTROMETRY: ION_SOURCE_TEMPERATURE 200 C
AC$MASS_SPECTROMETRY: SCAN_RANGE_M/Z 85-500
AC$CHROMATOGRAPHY: COLUMN_NAME InertCap 5MS/NP 0.25 mmI.D. x 30 m, df=0.25 um
AC$CHROMATOGRAPHY: INJECTION_TEMPERATURE 230 C
AC$CHROMATOGRAPHY: OVEN_TEMPERATURE 80 C(2 min)-15 C/min - 330C
AC$CHROMATOGRAPHY: RETENTION_INDEX 1543
AC$CHROMATOGRAPHY: RETENTION_TIME 602.93
AC$CHROMATOGRAPHY: TRANSFARLINE_TEMPERATURE 250 C

MS$FOCUSED_ION: DERIVATIVE_TYPE 3 TMS
MS$DATA_PROCESSING: WHOLE GCMSsolution

PK$SPLASH: splash10-00di-0901000000-5d60b0a446fd8122f613
PK$NUM_PEAK: 374
PK$PEAK: m/z int. rel.int.
  86.050000 272944.000000 171
  87.050000 30002.000000 19
  88.050000 11599.000000 7
  89.050000 6226.000000 4
  90.000000 650.000000 1
  91.150000 1220.000000 1
  92.100000 340.000000 1
  93.100000 207.000000 1
  94.100000 92.000000 1
  95.100000 388.000000 1
  96.100000 724.000000 1
  97.100000 1849.000000 1
  98.050000 8309.000000 5
  99.100000 14305.000000 9
  100.100000 152807.000000 96
  101.050000 20628.000000 13
  102.100000 17537.000000 11
  103.100000 6748.000000 4
  104.150000 1230.000000 1
  105.050000 2112.000000 1
  106.100000 209.000000 1
  107.100000 473.000000 1
  108.100000 258.000000 1
  109.100000 206.000000 1
  110.100000 879.000000 1
  111.050000 808.000000 1
  112.100000 7954.000000 5
  113.100000 6996.000000 4
  114.100000 22311.000000 14
  115.100000 12471.000000 8
  116.100000 15111.000000 9
  117.100000 25686.000000 16
  118.100000 5103.000000 3
  119.100000 6942.000000 4
  120.100000 801.000000 1
  121.100000 537.000000 1
  122.100000 95.000000 1
  123.100000 54.000000 1
  124.050000 1268.000000 1
  125.000000 532.000000 1
  126.100000 2108.000000 1
  127.150000 1484.000000 1
  128.100000 13238.000000 8
  129.100000 9977.000000 6
  130.100000 45590.000000 28
  131.100000 40380.000000 25
  132.100000 13033.000000 8
  133.100000 50986.000000 32
  134.100000 7545.000000 5
  135.100000 4423.000000 3
  135.700000 457.000000 1
  136.750000 976.000000 1
  137.700000 274.000000 1
  138.700000 10.000000 1
  140.150000 16264.000000 10
  141.150000 2476.000000 2
  142.100000 67785.000000 42
  143.100000 78097.000000 49
  144.250000 28310.000000 18
  145.250000 11555.000000 7
  146.150000 23251.000000 15
  147.150000 529815.000000 331
  148.150000 82947.000000 52
  149.150000 43101.000000 27
  150.150000 4597.000000 3
  151.150000 1483.000000 1
  152.100000 334.000000 1
  153.100000 63.000000 1
  154.050000 1257.000000 1
  155.100000 609.000000 1
  156.150000 19443.000000 12
  157.150000 7726.000000 5
  158.100000 14561.000000 9
  159.100000 3524.000000 2
  160.100000 4406.000000 3
  161.150000 3057.000000 2
  162.150000 1208.000000 1
  163.100000 578.000000 1
  164.100000 47.000000 1
  165.100000 68.000000 1
  166.100000 129.000000 1
  167.100000 58.000000 1
  168.100000 326.000000 1
  169.100000 198.000000 1
  170.100000 2998.000000 2
  171.150000 1818.000000 1
  172.150000 50840.000000 32
  173.150000 14462.000000 9
  174.150000 1598392.000000 999
  175.100000 268439.000000 168
  176.100000 118870.000000 74
  177.100000 14825.000000 9
  178.100000 2543.000000 2
  179.100000 417.000000 1
  180.100000 52.000000 1
  181.100000 134.000000 1
  182.100000 359.000000 1
  183.100000 114.000000 1
  184.100000 375.000000 1
  185.100000 327.000000 1
  186.150000 3356.000000 2
  187.100000 4847.000000 3
  188.100000 2802.000000 2
  189.100000 1857.000000 1
  190.000000 1388.000000 1
  191.000000 738.000000 1
  192.000000 222.000000 1
  193.000000 198.000000 1
  194.000000 106.000000 1
  195.000000 89.000000 1
  196.000000 316.000000 1
  197.000000 138.000000 1
  198.000000 1193.000000 1
  199.000000 351.000000 1
  200.100000 3076.000000 2
  201.100000 882.000000 1
  202.100000 759.000000 1
  203.100000 455.000000 1
  204.100000 5143.000000 3
  205.100000 3294.000000 2
  206.050000 1206.000000 1
  207.000000 673.000000 1
  208.000000 57.000000 1
  209.000000 225.000000 1
  210.000000 130.000000 1
  211.000000 39.000000 1
  212.000000 249.000000 1
  213.100000 310.000000 1
  214.100000 22286.000000 14
  215.150000 5315.000000 3
  216.100000 85852.000000 54
  217.100000 16625.000000 10
  218.050000 8297.000000 5
  219.100000 12196.000000 8
  220.050000 3419.000000 2
  221.100000 2542.000000 2
  222.100000 446.000000 1
  223.100000 154.000000 1
  224.100000 41.000000 1
  225.100000 68.000000 1
  226.100000 63.000000 1
  227.100000 39.000000 1
  228.150000 1585.000000 1
  229.100000 442.000000 1
  230.100000 13255.000000 8
  231.050000 2595.000000 2
  232.100000 3914.000000 2
  233.100000 793.000000 1
  234.100000 450.000000 1
  235.100000 175.000000 1
  236.100000 236.000000 1
  237.100000 121.000000 1
  238.100000 11.000000 1
  239.100000 180.000000 1
  240.100000 105.000000 1
  241.100000 38.000000 1
  242.100000 292.000000 1
  243.100000 844.000000 1
  244.100000 490.000000 1
  245.150000 1070.000000 1
  246.150000 76495.000000 48
  247.100000 16714.000000 10
  248.100000 7634.000000 5
  249.100000 1130.000000 1
  250.100000 230.000000 1
  251.100000 55.000000 1
  252.100000 74.000000 1
  253.100000 332.000000 1
  254.100000 66.000000 1
  255.100000 159.000000 1
  256.100000 60.000000 1
  257.100000 87.000000 1
  258.100000 30.000000 1
  259.100000 47.000000 1
  260.100000 169.000000 1
  261.100000 247.000000 1
  262.100000 54.000000 1
  264.100000 164.000000 1
  265.100000 105.000000 1
  266.100000 39.000000 1
  267.100000 66.000000 1
  268.100000 55.000000 1
  269.100000 118.000000 1
  270.100000 94.000000 1
  271.100000 62.000000 1
  272.100000 116.000000 1
  273.100000 60.000000 1
  274.100000 201.000000 1
  275.100000 718.000000 1
  276.100000 287.000000 1
  277.100000 76.000000 1
  278.100000 174.000000 1
  279.100000 42.000000 1
  280.100000 76.000000 1
  281.100000 100.000000 1
  282.100000 135.000000 1
  284.100000 81.000000 1
  285.100000 8.000000 1
  286.100000 129.000000 1
  287.200000 158.000000 1
  288.200000 4028.000000 3
  289.200000 1487.000000 1
  290.200000 623.000000 1
  291.200000 122.000000 1
  292.200000 161.000000 1
  293.200000 86.000000 1
  295.200000 106.000000 1
  296.200000 114.000000 1
  297.200000 38.000000 1
  298.200000 29.000000 1
  299.200000 82.000000 1
  300.200000 49.000000 1
  302.200000 1025.000000 1
  303.250000 3639.000000 2
  304.200000 392719.000000 245
  305.150000 113088.000000 71
  306.150000 54788.000000 34
  307.150000 11990.000000 7
  308.100000 2686.000000 2
  309.100000 274.000000 1
  310.100000 95.000000 1
  311.100000 6.000000 1
  312.100000 39.000000 1
  315.100000 16.000000 1
  316.100000 68.000000 1
  317.100000 247.000000 1
  318.100000 254.000000 1
  319.200000 1057.000000 1
  320.200000 489.000000 1
  321.200000 154.000000 1
  322.200000 62.000000 1
  324.200000 102.000000 1
  325.200000 52.000000 1
  326.200000 79.000000 1
  327.200000 94.000000 1
  328.200000 90.000000 1
  330.200000 42.000000 1
  331.200000 127.000000 1
  332.200000 79.000000 1
  333.200000 82.000000 1
  334.200000 47.000000 1
  335.200000 79.000000 1
  336.200000 8.000000 1
  338.200000 38.000000 1
  339.200000 2.000000 1
  340.200000 24.000000 1
  341.200000 27.000000 1
  343.200000 54.000000 1
  344.200000 6.000000 1
  345.200000 89.000000 1
  346.200000 121.000000 1
  347.200000 11.000000 1
  348.200000 33.000000 1
  350.200000 30.000000 1
  351.200000 100.000000 1
  352.200000 11.000000 1
  353.200000 66.000000 1
  354.200000 22.000000 1
  355.200000 82.000000 1
  359.200000 108.000000 1
  360.200000 3.000000 1
  363.200000 73.000000 1
  364.200000 30.000000 1
  365.200000 42.000000 1
  366.200000 68.000000 1
  367.200000 87.000000 1
  369.200000 153.000000 1
  370.200000 108.000000 1
  371.200000 6.000000 1
  373.200000 74.000000 1
  374.200000 60.000000 1
  375.200000 16.000000 1
  376.200000 158.000000 1
  377.200000 63.000000 1
  378.200000 14.000000 1
  379.200000 79.000000 1
  382.200000 58.000000 1
  383.200000 78.000000 1
  384.200000 36.000000 1
  385.200000 62.000000 1
  386.200000 2.000000 1
  387.200000 105.000000 1
  388.200000 114.000000 1
  389.200000 167.000000 1
  390.200000 95.000000 1
  391.200000 106.000000 1
  392.200000 52.000000 1
  393.200000 119.000000 1
  394.200000 92.000000 1
  395.200000 29.000000 1
  396.200000 73.000000 1
  397.200000 62.000000 1
  398.200000 89.000000 1
  400.200000 21.000000 1
  402.200000 38.000000 1
  403.200000 108.000000 1
  405.200000 153.000000 1
  406.200000 10.000000 1
  407.200000 47.000000 1
  408.200000 34.000000 1
  409.200000 47.000000 1
  410.200000 86.000000 1
  412.200000 19.000000 1
  413.200000 46.000000 1
  414.200000 118.000000 1
  416.200000 24.000000 1
  417.200000 79.000000 1
  418.200000 36.000000 1
  419.200000 63.000000 1
  420.200000 41.000000 1
  421.200000 10.000000 1
  422.200000 38.000000 1
  424.200000 52.000000 1
  425.200000 6.000000 1
  428.200000 39.000000 1
  430.200000 98.000000 1
  431.200000 18.000000 1
  432.200000 71.000000 1
  434.200000 57.000000 1
  435.200000 3.000000 1
  436.200000 21.000000 1
  437.200000 33.000000 1
  438.200000 111.000000 1
  439.200000 98.000000 1
  440.200000 62.000000 1
  442.200000 76.000000 1
  443.200000 39.000000 1
  444.200000 86.000000 1
  445.200000 62.000000 1
  446.200000 30.000000 1
  447.200000 2.000000 1
  448.200000 30.000000 1
  450.200000 33.000000 1
  452.200000 65.000000 1
  453.200000 39.000000 1
  454.200000 2.000000 1
  455.200000 58.000000 1
  457.200000 46.000000 1
  458.200000 34.000000 1
  459.200000 14.000000 1
  460.200000 41.000000 1
  461.200000 41.000000 1
  462.200000 44.000000 1
  463.200000 34.000000 1
  464.200000 50.000000 1
  465.200000 44.000000 1
  466.200000 21.000000 1
  467.200000 33.000000 1
  468.200000 78.000000 1
  472.200000 68.000000 1
  473.200000 21.000000 1
  474.200000 161.000000 1
  475.200000 18.000000 1
  476.200000 29.000000 1
  477.200000 102.000000 1
  478.200000 73.000000 1
  479.200000 14.000000 1
  482.200000 21.000000 1
  483.200000 44.000000 1
  484.200000 26.000000 1
  485.200000 103.000000 1
  486.200000 57.000000 1
  487.200000 84.000000 1
  488.200000 71.000000 1
  489.200000 111.000000 1
  490.200000 50.000000 1
  491.200000 58.000000 1
  492.200000 50.000000 1
  493.200000 161.000000 1
  495.200000 3.000000 1
  496.200000 39.000000 1
  497.200000 71.000000 1
  498.200000 21.000000 1
  499.200000 110.000000 1