ACCESSION: MSBNK-GL_Sciences_Inc-GLS00076
RECORD_TITLE: 2-Aminoadipic acid; EI-B; MS; 3 TMS; RT: 695.32 s
DATE: 2016.01.19 (Created 2012.08.03, modified 2013.07.31)
AUTHORS: Miyagawa H, Akimoto S, Yamasaki K, GL Sciences Inc.
LICENSE: CC BY-SA
COPYRIGHT: GL Sciences Inc.
COMMENT: The chemical compound was chemically modified with N-methyl-N-trimethylsilyl-trifluoroacetamide(MSTFA) before GC-MS analysis. When it has two or more functional groups, this modification gave a mixture of the TMS derivatives having different number of TMS groups at different functional groups.

CH$NAME: 2-Aminoadipic acid
CH$COMPOUND_CLASS: Natural Product
CH$FORMULA: C6H11NO4
CH$EXACT_MASS: 161.06881
CH$SMILES: OC(=O)CCC[C@H](N)C(O)=O
CH$IUPAC: InChI=1S/C6H11NO4/c7-4(6(10)11)2-1-3-5(8)9/h4H,1-3,7H2,(H,8,9)(H,10,11)/t4-/m0/s1
CH$LINK: CAS 1118-90-7
CH$LINK: KEGG C00956
CH$LINK: INCHIKEY OYIFNHCXNCRBQI-BYPYZUCNSA-N

AC$INSTRUMENT: GCMS-2010 Plus, Shimadzu
AC$INSTRUMENT_TYPE: EI-B
AC$MASS_SPECTROMETRY: MS_TYPE MS
AC$MASS_SPECTROMETRY: ION_MODE POSITIVE
AC$MASS_SPECTROMETRY: GAS_PRESSURE 75 kPa
AC$MASS_SPECTROMETRY: ION_SOURCE_TEMPERATURE 200 C
AC$MASS_SPECTROMETRY: SCAN_RANGE_M/Z 85-500
AC$CHROMATOGRAPHY: COLUMN_NAME InertCap 5MS/NP 0.25 mmI.D. x 30 m, df=0.25 um
AC$CHROMATOGRAPHY: INJECTION_TEMPERATURE 230 C
AC$CHROMATOGRAPHY: OVEN_TEMPERATURE 80 C(2 min)-15 C/min - 330C
AC$CHROMATOGRAPHY: RETENTION_INDEX 1727
AC$CHROMATOGRAPHY: RETENTION_TIME 695.32
AC$CHROMATOGRAPHY: TRANSFARLINE_TEMPERATURE 250 C

MS$FOCUSED_ION: DERIVATIVE_TYPE 3 TMS
MS$DATA_PROCESSING: WHOLE GCMSsolution

PK$SPLASH: splash10-03xr-0590000000-8c503403bd217bc5c3ec
PK$NUM_PEAK: 389
PK$PEAK: m/z int. rel.int.
  86.050000 6067.000000 13
  87.100000 3066.000000 7
  88.050000 1578.000000 4
  89.050000 2288.000000 5
  90.000000 692.000000 2
  91.000000 679.000000 2
  92.000000 234.000000 1
  93.000000 503.000000 1
  94.000000 489.000000 1
  95.100000 601.000000 1
  96.050000 4173.000000 9
  97.100000 1978.000000 4
  98.100000 32740.000000 73
  99.050000 6637.000000 15
  100.100000 56890.000000 126
  101.100000 8591.000000 19
  102.100000 5356.000000 12
  103.050000 4158.000000 9
  104.100000 714.000000 2
  105.100000 846.000000 2
  106.100000 266.000000 1
  107.100000 127.000000 1
  108.050000 6308.000000 14
  109.050000 1628.000000 4
  110.000000 673.000000 1
  111.000000 911.000000 2
  112.050000 3322.000000 7
  113.050000 1560.000000 3
  114.100000 7396.000000 16
  115.100000 50353.000000 112
  116.050000 20100.000000 45
  117.050000 13236.000000 29
  118.050000 2807.000000 6
  119.050000 2094.000000 5
  120.100000 274.000000 1
  121.100000 180.000000 1
  122.100000 348.000000 1
  123.100000 244.000000 1
  124.100000 297.000000 1
  125.100000 223.000000 1
  126.100000 2772.000000 6
  127.150000 1473.000000 3
  128.100000 142246.000000 316
  129.100000 69442.000000 154
  130.100000 15772.000000 35
  131.050000 19127.000000 42
  132.050000 8704.000000 19
  133.050000 19519.000000 43
  134.000000 2994.000000 7
  135.100000 2519.000000 6
  136.100000 270.000000 1
  137.100000 94.000000 1
  138.100000 958.000000 2
  139.100000 863.000000 2
  140.100000 1222.000000 3
  141.100000 1145.000000 3
  142.100000 4431.000000 10
  143.100000 3634.000000 8
  144.100000 1954.000000 4
  145.100000 3962.000000 9
  146.150000 2019.000000 4
  147.100000 86084.000000 191
  148.100000 15238.000000 34
  149.100000 13681.000000 30
  150.100000 2124.000000 5
  151.100000 708.000000 2
  152.100000 1335.000000 3
  153.100000 548.000000 1
  154.100000 18546.000000 41
  155.100000 4500.000000 10
  156.050000 4917.000000 11
  157.100000 1649.000000 4
  158.000000 1097.000000 2
  159.100000 1222.000000 3
  160.150000 1112.000000 2
  161.200000 684.000000 2
  162.100000 442.000000 1
  163.100000 9310.000000 21
  164.050000 1600.000000 4
  165.100000 866.000000 2
  166.100000 374.000000 1
  167.100000 97.000000 1
  168.100000 1626.000000 4
  169.100000 527.000000 1
  170.100000 26215.000000 58
  171.100000 5772.000000 13
  172.050000 10592.000000 24
  173.100000 2431.000000 5
  174.050000 6154.000000 14
  175.050000 1386.000000 3
  176.000000 698.000000 2
  177.000000 710.000000 2
  178.000000 345.000000 1
  179.000000 346.000000 1
  180.000000 934.000000 2
  181.000000 374.000000 1
  182.050000 9188.000000 20
  183.000000 1687.000000 4
  184.000000 590.000000 1
  185.000000 210.000000 1
  186.000000 582.000000 1
  187.150000 1044.000000 2
  188.050000 15764.000000 35
  189.100000 2758.000000 6
  190.050000 2250.000000 5
  191.000000 1570.000000 3
  192.000000 385.000000 1
  193.000000 343.000000 1
  194.000000 87.000000 1
  195.000000 92.000000 1
  196.000000 321.000000 1
  197.000000 566.000000 1
  198.100000 1127.000000 3
  199.000000 250.000000 1
  200.050000 2131.000000 5
  201.100000 441.000000 1
  202.100000 5378.000000 12
  203.050000 9695.000000 22
  204.050000 3512.000000 8
  205.050000 11598.000000 26
  206.000000 2270.000000 5
  206.950000 1912.000000 4
  208.000000 228.000000 1
  209.000000 164.000000 1
  210.000000 135.000000 1
  211.000000 116.000000 1
  212.000000 1015.000000 2
  213.000000 602.000000 1
  214.000000 582.000000 1
  215.000000 610.000000 1
  216.150000 5482.000000 12
  217.050000 320470.000000 712
  218.100000 91852.000000 204
  219.050000 36806.000000 82
  220.050000 7027.000000 16
  221.050000 6430.000000 14
  222.000000 1278.000000 3
  223.000000 681.000000 2
  224.000000 199.000000 1
  225.000000 81.000000 1
  226.000000 694.000000 2
  227.100000 374.000000 1
  228.100000 8590.000000 19
  229.050000 2409.000000 5
  230.050000 1365.000000 3
  231.100000 882.000000 2
  232.050000 1856.000000 4
  233.100000 598.000000 1
  234.100000 222.000000 1
  235.100000 154.000000 1
  236.100000 145.000000 1
  237.100000 252.000000 1
  238.100000 71.000000 1
  239.100000 74.000000 1
  240.100000 134.000000 1
  241.100000 122.000000 1
  242.100000 1012.000000 2
  243.150000 1201.000000 3
  244.100000 80940.000000 180
  245.100000 17900.000000 40
  246.100000 8438.000000 19
  247.100000 1263.000000 3
  248.100000 207.000000 1
  249.100000 58.000000 1
  251.100000 98.000000 1
  253.100000 111.000000 1
  254.100000 1263.000000 3
  255.100000 327.000000 1
  256.100000 260.000000 1
  257.100000 250.000000 1
  258.100000 994.000000 2
  259.150000 4929.000000 11
  260.100000 449694.000000 999
  261.100000 104844.000000 233
  262.100000 42849.000000 95
  263.100000 7442.000000 17
  264.100000 1292.000000 3
  265.100000 119.000000 1
  266.100000 73.000000 1
  267.100000 47.000000 1
  268.100000 86.000000 1
  269.100000 11.000000 1
  270.100000 791.000000 2
  271.100000 234.000000 1
  272.100000 34076.000000 76
  273.150000 8322.000000 18
  274.100000 3481.000000 8
  275.100000 742.000000 2
  276.100000 207.000000 1
  277.100000 113.000000 1
  278.100000 166.000000 1
  279.100000 433.000000 1
  280.100000 196.000000 1
  281.100000 129.000000 1
  282.100000 46.000000 1
  283.100000 68.000000 1
  284.100000 71.000000 1
  285.100000 127.000000 1
  286.100000 801.000000 2
  287.150000 1195.000000 3
  288.100000 8362.000000 19
  289.100000 2223.000000 5
  290.050000 992.000000 2
  291.100000 9690.000000 22
  292.050000 2650.000000 6
  293.100000 1446.000000 3
  294.100000 434.000000 1
  295.100000 108.000000 1
  296.100000 106.000000 1
  298.100000 58.000000 1
  299.100000 65.000000 1
  300.100000 10.000000 1
  301.100000 34.000000 1
  302.100000 66.000000 1
  303.100000 135.000000 1
  304.100000 198.000000 1
  305.100000 82.000000 1
  306.100000 146.000000 1
  307.100000 218.000000 1
  308.100000 58.000000 1
  309.100000 273.000000 1
  310.100000 22.000000 1
  311.100000 49.000000 1
  312.100000 50.000000 1
  314.100000 100.000000 1
  315.100000 89.000000 1
  316.100000 274.000000 1
  317.100000 103.000000 1
  318.100000 364.000000 1
  319.100000 27.000000 1
  320.100000 100.000000 1
  321.100000 21.000000 1
  322.100000 55.000000 1
  325.100000 14.000000 1
  326.100000 57.000000 1
  327.100000 138.000000 1
  328.100000 73.000000 1
  331.100000 24.000000 1
  332.100000 113.000000 1
  333.200000 122.000000 1
  334.200000 5674.000000 13
  335.200000 1692.000000 4
  336.200000 785.000000 2
  337.200000 206.000000 1
  338.200000 57.000000 1
  339.200000 76.000000 1
  340.200000 44.000000 1
  341.200000 135.000000 1
  342.200000 60.000000 1
  343.200000 21.000000 1
  344.200000 362.000000 1
  345.200000 348.000000 1
  346.200000 145.000000 1
  347.200000 114.000000 1
  348.200000 150.000000 1
  349.200000 138.000000 1
  350.200000 21.000000 1
  351.200000 6.000000 1
  352.200000 103.000000 1
  353.200000 33.000000 1
  354.200000 26.000000 1
  355.200000 129.000000 1
  357.200000 41.000000 1
  358.200000 57.000000 1
  359.200000 8.000000 1
  360.200000 338.000000 1
  361.100000 518.000000 1
  362.150000 24643.000000 55
  363.100000 6785.000000 15
  364.150000 3464.000000 8
  365.100000 830.000000 2
  366.100000 222.000000 1
  367.100000 31.000000 1
  368.100000 74.000000 1
  369.100000 114.000000 1
  370.100000 31.000000 1
  371.100000 21.000000 1
  372.100000 41.000000 1
  373.100000 34.000000 1
  374.100000 71.000000 1
  375.100000 89.000000 1
  376.200000 329.000000 1
  377.150000 17652.000000 39
  378.150000 5430.000000 12
  379.200000 2892.000000 6
  380.200000 734.000000 2
  381.200000 254.000000 1
  382.200000 111.000000 1
  383.200000 16.000000 1
  384.200000 92.000000 1
  385.200000 19.000000 1
  386.200000 33.000000 1
  387.200000 122.000000 1
  388.200000 33.000000 1
  389.200000 92.000000 1
  390.200000 49.000000 1
  391.200000 47.000000 1
  392.200000 63.000000 1
  393.200000 57.000000 1
  394.200000 57.000000 1
  395.200000 62.000000 1
  397.200000 119.000000 1
  398.200000 76.000000 1
  399.200000 38.000000 1
  400.200000 90.000000 1
  401.200000 50.000000 1
  402.200000 27.000000 1
  403.200000 44.000000 1
  404.200000 10.000000 1
  405.200000 92.000000 1
  406.200000 119.000000 1
  407.200000 18.000000 1
  408.200000 84.000000 1
  409.200000 65.000000 1
  410.200000 146.000000 1
  411.200000 108.000000 1
  413.200000 18.000000 1
  415.200000 70.000000 1
  416.200000 54.000000 1
  417.200000 24.000000 1
  418.200000 97.000000 1
  419.200000 68.000000 1
  420.200000 19.000000 1
  421.200000 57.000000 1
  422.200000 39.000000 1
  423.200000 57.000000 1
  424.200000 42.000000 1
  425.200000 81.000000 1
  426.200000 10.000000 1
  427.200000 102.000000 1
  428.200000 47.000000 1
  429.200000 63.000000 1
  430.200000 47.000000 1
  431.200000 18.000000 1
  432.200000 60.000000 1
  433.200000 148.000000 1
  435.200000 42.000000 1
  436.200000 86.000000 1
  437.200000 62.000000 1
  440.200000 135.000000 1
  441.200000 68.000000 1
  442.200000 76.000000 1
  443.200000 8.000000 1
  445.200000 98.000000 1
  446.200000 102.000000 1
  447.200000 38.000000 1
  448.200000 71.000000 1
  449.200000 58.000000 1
  450.200000 73.000000 1
  451.200000 79.000000 1
  452.200000 50.000000 1
  454.200000 13.000000 1
  455.200000 58.000000 1
  456.200000 38.000000 1
  457.200000 34.000000 1
  459.200000 14.000000 1
  461.200000 10.000000 1
  464.200000 57.000000 1
  467.200000 5.000000 1
  468.200000 142.000000 1
  469.200000 8.000000 1
  470.200000 31.000000 1
  471.200000 50.000000 1
  473.200000 3.000000 1
  474.200000 31.000000 1
  475.200000 58.000000 1
  476.200000 39.000000 1
  477.200000 47.000000 1
  478.200000 78.000000 1
  479.200000 27.000000 1
  480.200000 8.000000 1
  481.200000 161.000000 1
  482.200000 82.000000 1
  483.200000 60.000000 1
  484.200000 89.000000 1
  485.200000 87.000000 1
  486.200000 194.000000 1
  487.200000 95.000000 1
  488.200000 34.000000 1
  489.200000 47.000000 1
  490.200000 26.000000 1
  491.200000 5.000000 1
  492.200000 19.000000 1
  493.200000 2.000000 1
  495.200000 68.000000 1
  496.200000 47.000000 1
  497.200000 119.000000 1
  498.200000 13.000000 1
  499.200000 50.000000 1