ACCESSION: MSBNK-GL_Sciences_Inc-GLS00089
RECORD_TITLE: N-alpha-Acetyl-L-Lysine; EI-B; MS; n TMS; RT: 867.55 s
DATE: 2016.01.19 (Created 2012.08.03, modified 2013.07.31)
AUTHORS: Miyagawa H, Akimoto S, Yamasaki K, GL Sciences Inc.
LICENSE: CC BY-SA
COPYRIGHT: GL Sciences Inc.
COMMENT: The chemical compound was chemically modified with N-methyl-N-trimethylsilyl-trifluoroacetamide(MSTFA) before GC-MS analysis. When it has two or more functional groups, this modification gave a mixture of the TMS derivatives having different number of TMS groups at different functional groups.

CH$NAME: N-alpha-Acetyl-L-Lysine
CH$NAME: N-a-Acetyl-L-Lysine
CH$COMPOUND_CLASS: Natural Product
CH$FORMULA: C8H16N2O3
CH$EXACT_MASS: 188.11609
CH$SMILES: NCCCCC(NC(C)=O)C(O)=O
CH$IUPAC: InChI=1S/C8H16N2O3/c1-6(11)10-7(8(12)13)4-2-3-5-9/h7H,2-5,9H2,1H3,(H,10,11)(H,12,13)/t7-/m0/s1
CH$LINK: CAS 1946-82-3
CH$LINK: CHEBI 35704
CH$LINK: KEGG C12989
CH$LINK: PUBCHEM 583378
CH$LINK: INCHIKEY VEYYWZRYIYDQJM-ZETCQYMHSA-N

AC$INSTRUMENT: GCMS-2010 Plus, Shimadzu
AC$INSTRUMENT_TYPE: EI-B
AC$MASS_SPECTROMETRY: MS_TYPE MS
AC$MASS_SPECTROMETRY: ION_MODE POSITIVE
AC$MASS_SPECTROMETRY: GAS_PRESSURE 75 kPa
AC$MASS_SPECTROMETRY: ION_SOURCE_TEMPERATURE 200 C
AC$MASS_SPECTROMETRY: SCAN_RANGE_M/Z 85-500
AC$CHROMATOGRAPHY: COLUMN_NAME InertCap 5MS/NP 0.25 mmI.D. x 30 m, df=0.25 um
AC$CHROMATOGRAPHY: INJECTION_TEMPERATURE 230 C
AC$CHROMATOGRAPHY: OVEN_TEMPERATURE 80 C(2 min)-15 C/min - 330C
AC$CHROMATOGRAPHY: RETENTION_INDEX 2126
AC$CHROMATOGRAPHY: RETENTION_TIME 867.55
AC$CHROMATOGRAPHY: TRANSFARLINE_TEMPERATURE 250 C

MS$FOCUSED_ION: DERIVATIVE_TYPE n TMS
MS$DATA_PROCESSING: WHOLE GCMSsolution

PK$SPLASH: splash10-00di-0900000000-0560b00567e5bfdfecea
PK$NUM_PEAK: 389
PK$PEAK: m/z int. rel.int.
  86.050000 144473.000000 117
  87.050000 16076.000000 13
  88.050000 12232.000000 10
  89.100000 2814.000000 2
  90.100000 887.000000 1
  91.100000 782.000000 1
  92.100000 558.000000 1
  93.100000 423.000000 1
  94.050000 4689.000000 4
  95.050000 4339.000000 4
  96.050000 10998.000000 9
  97.100000 2582.000000 2
  98.100000 40809.000000 33
  99.100000 8158.000000 7
  100.050000 82890.000000 67
  101.050000 9761.000000 8
  102.050000 24212.000000 20
  103.050000 4364.000000 4
  104.050000 2525.000000 2
  105.100000 790.000000 1
  106.100000 551.000000 1
  107.100000 383.000000 1
  108.100000 8959.000000 7
  109.100000 1582.000000 1
  110.050000 2942.000000 2
  111.150000 1816.000000 1
  112.050000 11493.000000 9
  113.050000 5455.000000 4
  114.050000 11669.000000 9
  115.050000 6196.000000 5
  116.050000 26997.000000 22
  117.050000 12587.000000 10
  118.050000 4502.000000 4
  119.050000 2962.000000 2
  120.000000 548.000000 1
  121.000000 239.000000 1
  122.000000 207.000000 1
  123.150000 1045.000000 1
  124.100000 2106.000000 2
  125.100000 1967.000000 2
  126.100000 10782.000000 9
  127.100000 1654.000000 1
  128.050000 15015.000000 12
  129.050000 10007.000000 8
  130.050000 31062.000000 25
  131.050000 20792.000000 17
  132.050000 8934.000000 7
  133.050000 14755.000000 12
  134.050000 3333.000000 3
  135.050000 3574.000000 3
  136.150000 1202.000000 1
  137.100000 546.000000 1
  138.100000 866.000000 1
  139.100000 369.000000 1
  140.100000 4262.000000 3
  141.100000 2143.000000 2
  142.100000 13342.000000 11
  143.100000 4625.000000 4
  144.050000 6351.000000 5
  145.100000 4374.000000 4
  146.100000 13649.000000 11
  147.050000 55433.000000 45
  148.100000 11041.000000 9
  149.100000 8383.000000 7
  150.000000 1666.000000 1
  151.000000 906.000000 1
  152.100000 2974.000000 2
  153.150000 2216.000000 2
  154.100000 4706.000000 4
  155.150000 3247.000000 3
  156.150000 82745.000000 67
  157.150000 14654.000000 12
  158.100000 18802.000000 15
  159.100000 8063.000000 7
  160.100000 3607.000000 3
  161.100000 1529.000000 1
  162.100000 652.000000 1
  163.100000 658.000000 1
  164.100000 210.000000 1
  165.100000 564.000000 1
  166.100000 4002.000000 3
  167.050000 1405.000000 1
  168.100000 4834.000000 4
  169.050000 7420.000000 6
  170.100000 5433.000000 4
  171.100000 2884.000000 2
  172.100000 16798.000000 14
  173.150000 10825.000000 9
  174.100000 1232719.000000 999
  175.100000 227700.000000 185
  176.100000 95938.000000 78
  177.100000 11535.000000 9
  178.000000 2010.000000 2
  179.100000 2638.000000 2
  180.100000 724.000000 1
  181.000000 527.000000 1
  182.050000 6072.000000 5
  183.100000 1873.000000 2
  184.050000 10784.000000 9
  185.100000 4242.000000 3
  186.100000 58558.000000 47
  187.100000 9638.000000 8
  188.050000 7520.000000 6
  189.050000 1875.000000 2
  190.000000 4690.000000 4
  191.050000 1821.000000 1
  191.950000 1126.000000 1
  192.900000 305.000000 1
  193.900000 132.000000 1
  194.900000 609.000000 1
  195.900000 633.000000 1
  197.150000 1402.000000 1
  198.100000 24945.000000 20
  199.050000 5352.000000 4
  200.050000 28859.000000 23
  201.100000 5287.000000 4
  202.050000 3430.000000 3
  203.000000 708.000000 1
  204.000000 3924.000000 3
  205.100000 1655.000000 1
  206.000000 1174.000000 1
  207.000000 1732.000000 1
  208.000000 641.000000 1
  209.000000 1140.000000 1
  210.050000 1107.000000 1
  211.000000 590.000000 1
  212.100000 626.000000 1
  213.050000 5838.000000 5
  214.050000 6350.000000 5
  215.100000 1943.000000 2
  216.100000 13385.000000 11
  217.050000 3276.000000 3
  218.050000 1834.000000 1
  218.950000 1159.000000 1
  220.000000 490.000000 1
  221.000000 5650.000000 5
  222.150000 1427.000000 1
  223.100000 1030.000000 1
  224.100000 465.000000 1
  225.100000 7270.000000 6
  226.100000 3599.000000 3
  227.050000 2063.000000 2
  228.050000 39668.000000 32
  229.000000 7761.000000 6
  230.050000 5927.000000 5
  231.100000 1431.000000 1
  232.100000 602.000000 1
  233.100000 244.000000 1
  234.100000 129.000000 1
  235.100000 89.000000 1
  237.100000 8.000000 1
  238.100000 217.000000 1
  239.100000 358.000000 1
  240.100000 652.000000 1
  241.150000 1389.000000 1
  242.100000 15060.000000 12
  243.100000 3796.000000 3
  244.050000 1678.000000 1
  245.100000 710.000000 1
  246.050000 973.000000 1
  247.100000 166.000000 1
  248.100000 404.000000 1
  249.100000 199.000000 1
  250.100000 62.000000 1
  251.100000 55.000000 1
  252.100000 18.000000 1
  253.100000 177.000000 1
  254.100000 439.000000 1
  255.100000 663.000000 1
  256.100000 994.000000 1
  257.050000 1244.000000 1
  258.050000 3742.000000 3
  259.100000 1134.000000 1
  260.100000 617.000000 1
  261.100000 4711.000000 4
  262.100000 1002.000000 1
  263.100000 726.000000 1
  264.100000 654.000000 1
  265.100000 174.000000 1
  266.100000 124.000000 1
  267.100000 63.000000 1
  268.100000 97.000000 1
  269.100000 47.000000 1
  270.100000 292.000000 1
  271.150000 1475.000000 1
  272.100000 3732.000000 3
  273.150000 1072.000000 1
  274.100000 2910.000000 2
  275.100000 782.000000 1
  276.100000 244.000000 1
  277.100000 300.000000 1
  278.100000 19492.000000 16
  279.050000 4907.000000 4
  280.050000 2389.000000 2
  281.100000 713.000000 1
  282.100000 351.000000 1
  283.100000 286.000000 1
  284.100000 167.000000 1
  285.100000 106.000000 1
  286.100000 81.000000 1
  287.150000 3110.000000 3
  288.100000 3902.000000 3
  289.100000 983.000000 1
  290.200000 1302.000000 1
  291.200000 278.000000 1
  292.200000 287.000000 1
  293.200000 201.000000 1
  294.200000 81.000000 1
  296.200000 62.000000 1
  297.200000 756.000000 1
  298.100000 343.000000 1
  299.100000 7666.000000 6
  300.150000 4687.000000 4
  301.100000 1970.000000 2
  302.150000 967.000000 1
  303.150000 23144.000000 19
  304.150000 5889.000000 5
  305.100000 2254.000000 2
  306.100000 372.000000 1
  307.100000 337.000000 1
  308.100000 49.000000 1
  309.100000 146.000000 1
  310.100000 90.000000 1
  311.100000 39.000000 1
  312.100000 11.000000 1
  313.100000 719.000000 1
  314.200000 658.000000 1
  315.200000 3518.000000 3
  316.150000 1550.000000 1
  317.100000 900.000000 1
  318.100000 562.000000 1
  319.100000 42.000000 1
  320.100000 27.000000 1
  321.100000 65.000000 1
  322.100000 8.000000 1
  323.100000 129.000000 1
  324.100000 13.000000 1
  326.100000 31.000000 1
  327.100000 127.000000 1
  328.100000 111.000000 1
  329.100000 68.000000 1
  330.100000 446.000000 1
  331.150000 23156.000000 19
  332.100000 7089.000000 6
  333.150000 4069.000000 3
  334.100000 1094.000000 1
  335.100000 282.000000 1
  336.100000 74.000000 1
  337.100000 63.000000 1
  338.100000 27.000000 1
  339.100000 11.000000 1
  340.100000 50.000000 1
  341.100000 54.000000 1
  342.100000 148.000000 1
  343.100000 34.000000 1
  344.100000 86.000000 1
  345.100000 414.000000 1
  346.100000 233.000000 1
  347.100000 191.000000 1
  348.100000 228.000000 1
  349.100000 30.000000 1
  350.100000 79.000000 1
  351.100000 70.000000 1
  352.100000 81.000000 1
  353.100000 47.000000 1
  355.100000 143.000000 1
  356.100000 102.000000 1
  357.100000 79.000000 1
  358.100000 50.000000 1
  359.100000 151.000000 1
  360.100000 398.000000 1
  361.100000 150.000000 1
  362.100000 154.000000 1
  363.100000 74.000000 1
  364.100000 47.000000 1
  366.100000 34.000000 1
  368.100000 34.000000 1
  369.100000 24.000000 1
  370.100000 3.000000 1
  371.100000 225.000000 1
  372.100000 198.000000 1
  373.100000 254.000000 1
  374.100000 118.000000 1
  375.100000 97.000000 1
  376.100000 66.000000 1
  377.100000 97.000000 1
  378.100000 30.000000 1
  379.100000 47.000000 1
  380.100000 41.000000 1
  381.100000 22.000000 1
  382.100000 130.000000 1
  383.100000 54.000000 1
  384.100000 73.000000 1
  385.100000 16.000000 1
  386.100000 26.000000 1
  387.100000 178.000000 1
  388.250000 1184.000000 1
  389.150000 47341.000000 38
  390.150000 16348.000000 13
  391.100000 7310.000000 6
  392.100000 2001.000000 2
  393.100000 617.000000 1
  394.100000 148.000000 1
  395.100000 24.000000 1
  399.100000 86.000000 1
  401.100000 62.000000 1
  402.100000 105.000000 1
  403.200000 169.000000 1
  404.150000 14615.000000 12
  405.150000 6062.000000 5
  406.150000 2772.000000 2
  407.200000 631.000000 1
  408.200000 250.000000 1
  409.200000 2.000000 1
  411.200000 42.000000 1
  412.200000 39.000000 1
  414.200000 118.000000 1
  415.200000 49.000000 1
  416.200000 89.000000 1
  417.200000 97.000000 1
  418.200000 22.000000 1
  419.200000 62.000000 1
  420.200000 98.000000 1
  421.200000 44.000000 1
  422.200000 29.000000 1
  423.200000 22.000000 1
  424.200000 26.000000 1
  426.200000 52.000000 1
  427.200000 82.000000 1
  428.200000 81.000000 1
  429.200000 44.000000 1
  431.200000 47.000000 1
  432.200000 95.000000 1
  433.200000 122.000000 1
  434.200000 90.000000 1
  435.200000 16.000000 1
  436.200000 44.000000 1
  438.200000 60.000000 1
  439.200000 18.000000 1
  442.200000 33.000000 1
  443.200000 24.000000 1
  444.200000 95.000000 1
  445.200000 116.000000 1
  446.200000 44.000000 1
  447.200000 41.000000 1
  449.200000 49.000000 1
  450.200000 11.000000 1
  451.200000 21.000000 1
  452.200000 113.000000 1
  453.200000 87.000000 1
  454.200000 29.000000 1
  456.200000 113.000000 1
  458.200000 50.000000 1
  459.200000 100.000000 1
  460.200000 71.000000 1
  461.200000 156.000000 1
  462.200000 54.000000 1
  463.200000 110.000000 1
  465.200000 78.000000 1
  466.200000 16.000000 1
  468.200000 16.000000 1
  469.200000 58.000000 1
  470.200000 31.000000 1
  471.200000 98.000000 1
  472.200000 26.000000 1
  473.200000 70.000000 1
  474.200000 14.000000 1
  475.200000 58.000000 1
  476.200000 81.000000 1
  477.200000 535.000000 1
  478.200000 239.000000 1
  479.200000 190.000000 1
  480.200000 81.000000 1
  481.200000 102.000000 1
  482.200000 41.000000 1
  484.200000 16.000000 1
  485.200000 111.000000 1
  486.200000 34.000000 1
  487.200000 44.000000 1
  488.200000 21.000000 1
  489.200000 63.000000 1
  490.200000 6.000000 1
  491.200000 86.000000 1
  492.200000 66.000000 1
  494.200000 30.000000 1
  495.200000 57.000000 1
  496.200000 19.000000 1
  497.200000 94.000000 1
  498.200000 44.000000 1