ACCESSION: MSBNK-ISAS_Dortmund-IA000052
RECORD_TITLE: 15d-PGJ2-[d4]; LC-ESI-QFT; MS2; CE: 20.0; R=30.000; [M-H]-
DATE: 2018.11.21
AUTHORS: Nils Hoffmann, Dominik Kopczynski, Bing Peng
LICENSE: CC BY-SA
COPYRIGHT: Copyright (C) 2019, Leibniz Institut fuer Analytische Wissenschaften - ISAS - e.V., Dortmund, Germany
COMMENT: CONFIDENCE standard compound
COMMENT: NATIVE_RUN_ID QExHF03_NM_0000149.mzML
COMMENT: PROCESSING averaging of repeated ion fragments at 20.0 NCE within 5 ppm window [MS, MS:1000575, mean of spectra, ]

CH$NAME: 15d-PGJ2-[d4]
CH$COMPOUND_CLASS: Natural Product; Lipid Standard
CH$FORMULA: C20H30O4
CH$EXACT_MASS: 334.21441
CH$SMILES: CCCCC[C@H](O)\C=C\[C@@H]1[C@@H](C\C=C/CCCC(O)=O)C=CC1=O
CH$IUPAC: InChI=1S/C20H30O4/c1-2-3-6-10-17(21)13-14-18-16(12-15-19(18)22)9-7-4-5-8-11-20(23)24/h4,7,12-18,21H,2-3,5-6,8-11H2,1H3,(H,23,24)/b7-4-,14-13+/t16-,17-,18+/m0/s1
CH$LINK: CHEBI CHEBI:27485
CH$LINK: LIPIDMAPS LMFA03010019
CH$LINK: INCHIKEY UQOQENZZLBSFKO-POPPZSFYSA-N
CH$LINK: PUBCHEM CID:5280884
CH$LINK: COMPTOX DTXSID4041105

AC$INSTRUMENT: Q-Exactive HF, Thermo Scientific [MS:1002523]
AC$INSTRUMENT_TYPE: LC-ESI-QFT
AC$MASS_SPECTROMETRY: MS_TYPE MS2
AC$MASS_SPECTROMETRY: ION_MODE NEGATIVE
AC$MASS_SPECTROMETRY: IONIZATION ESI
AC$MASS_SPECTROMETRY: FRAGMENTATION_MODE HCD
AC$MASS_SPECTROMETRY: COLLISION_ENERGY 20.0 NCE
AC$MASS_SPECTROMETRY: RESOLUTION 30.000

MS$FOCUSED_ION: BASE_PEAK 319.2217
MS$FOCUSED_ION: PRECURSOR_M/Z 319.2217
MS$FOCUSED_ION: PRECURSOR_TYPE [M-H]-

PK$SPLASH: splash10-004i-0093000000-e6f10c57d5709e964618
PK$ANNOTATION: m/z annotation exact_mass error(ppm)
  59.01351093110584 59.014 59.0135 0.18523059707121628
  161.0927247546968 161.093 161.0925 1.395190321085453
  203.14444986979166 203.144 203.1443 0.7377504152450866
  245.18779936290923 245.188 245.1878 -0.0025983788090944617
  275.23175630115327 275.232 275.2318 -0.15877106768654906
  301.2110537574405 301.211 301.211 0.178471040112936
  319.2216084798177 precursor 319.221675390909 -0.2096069799230679
PK$NUM_PEAK: 7
PK$PEAK: m/z int. rel.int.
  59.01351093110584 658874.3523809524 5
  161.0927247546968 600850.8 5
  203.14444986979166 3186980.5523809516 27
  245.18779936290923 898768.5571428572 7
  275.23175630115327 115272215.23809524 999
  301.2110537574405 2031022.414285714 17
  319.2216084798177 50131935.809523806 434