ACCESSION: MSBNK-Fac_Eng_Univ_Tokyo-JP000149
RECORD_TITLE: SAFRAMYCIN-C; EI-B; MS
DATE: 2016.01.19 (Created 2008.10.21, modified 2011.05.06)
AUTHORS: FUKUSHIMA K, INST. FOR CHEMOBIODYNAMICS, CHIBA UNIV.
LICENSE: CC BY-NC-SA

CH$NAME: SAFRAMYCIN-C
CH$COMPOUND_CLASS: N/A
CH$FORMULA: C29H33N3O9
CH$EXACT_MASS: 567.22168
CH$SMILES: N/A
CH$IUPAC: N/A

AC$INSTRUMENT: JEOL JMS-01-SG-2
AC$INSTRUMENT_TYPE: EI-B
AC$MASS_SPECTROMETRY: MS_TYPE MS
AC$MASS_SPECTROMETRY: ION_MODE POSITIVE
AC$MASS_SPECTROMETRY: IONIZATION_ENERGY 70 eV

MS$FOCUSED_ION: ION_TYPE [M]+*

PK$SPLASH: splash10-0159-7190410000-7703f3f945a3c94c3b45
PK$NUM_PEAK: 73
PK$PEAK: m/z int. rel.int.
  14 1.03 10
  15 12.39 124
  16 1.08 11
  19 1.8 18
  26 1 10
  27 5.55 56
  29 22.69 227
  30 5.81 58
  31 99.99 999
  32 19.2 192
  41 2.29 23
  45 23.11 231
  51 1.09 11
  59 11.93 119
  60 1.23 12
  74 9.24 92
  77 1.79 18
  85 4.24 42
  87 1.22 12
  91 1.53 15
  105 1.17 12
  118 2.05 21
  119 2.08 21
  130 1.12 11
  131 5.3 53
  132 2.14 21
  133 1.44 14
  134 1.59 16
  144 1.45 15
  160 1.68 17
  164 1.01 10
  174 2.21 22
  175 3.27 33
  176 4.31 43
  178 1.64 16
  188 2.95 30
  190 5.01 50
  194 1.56 16
  201 4.32 43
  202 4.78 48
  203 4.91 49
  204 9.08 91
  205 6.13 61
  206 3.95 40
  216 2.77 28
  217 1.74 17
  218 93.36 934
  219 27.88 279
  220 26.2 262
  221 3.47 35
  223 1.48 15
  232 19.38 194
  233 5.3 53
  234 10.37 104
  235 4.43 44
  248 2.55 26
  250 12.69 127
  259 2.48 25
  264 4.07 41
  265 6.34 63
  317 2.04 20
  319 1.89 19
  435 25.99 260
  436 6.67 67
  437 8.48 85
  438 1.33 13
  467 44.26 443
  468 14.45 145
  469 11.76 118
  470 2.31 23
  567 20.1 201
  568 6.55 66
  569 2.05 21