ACCESSION: MSBNK-Fac_Eng_Univ_Tokyo-JP000150
RECORD_TITLE: SAFRAMYCIN-C; FD-B; MS
DATE: 2016.01.19 (Created 2008.10.21, modified 2011.05.06)
AUTHORS: FUKUSHIMA K, INST. FOR CHEMOBIODYNAMICS, CHIBA UNIV.
LICENSE: CC BY-NC-SA

CH$NAME: SAFRAMYCIN-C
CH$COMPOUND_CLASS: N/A
CH$FORMULA: C29H33N3O9
CH$EXACT_MASS: 567.22168
CH$SMILES: N/A
CH$IUPAC: N/A

AC$INSTRUMENT: Unknown
AC$INSTRUMENT_TYPE: FD-B
AC$MASS_SPECTROMETRY: MS_TYPE MS
AC$MASS_SPECTROMETRY: ION_MODE POSITIVE

MS$FOCUSED_ION: ION_TYPE [M]+*

PK$SPLASH: splash10-014i-0010090000-c093c31f112ddebcd8c9
PK$NUM_PEAK: 6
PK$PEAK: m/z int. rel.int.
  242 26.75 268
  523 14.2 142
  530 8.3 83
  567 99.99 999
  568 31.18 312
  569 6.64 66