ACCESSION: MSBNK-Fac_Eng_Univ_Tokyo-JP000387
RECORD_TITLE: 1,1-DIISOPROPYLHYDRAZINE; EI-B; MS
DATE: 2016.01.19 (Created 2008.10.21, modified 2011.05.06)
AUTHORS: SASAKI S, TOYOHASHI UNIV. OF TECH.
LICENSE: CC BY-NC-SA

CH$NAME: 1,1-DIISOPROPYLHYDRAZINE
CH$COMPOUND_CLASS: N/A
CH$FORMULA: C6H16N2
CH$EXACT_MASS: 116.13135
CH$SMILES: CC(C)N(N)C(C)C
CH$IUPAC: InChI=1S/C6H16N2/c1-5(2)8(7)6(3)4/h5-6H,7H2,1-4H3
CH$LINK: INCHIKEY CDLZUDXUPFCTRJ-UHFFFAOYSA-N
CH$LINK: COMPTOX DTXSID00238861

AC$INSTRUMENT: SHIMADZU LKB-2091
AC$INSTRUMENT_TYPE: EI-B
AC$MASS_SPECTROMETRY: MS_TYPE MS
AC$MASS_SPECTROMETRY: ION_MODE POSITIVE
AC$MASS_SPECTROMETRY: IONIZATION_ENERGY 70 eV

MS$FOCUSED_ION: ION_TYPE [M]+*

PK$SPLASH: splash10-0a4i-9100000000-af738f4e25e13095065e
PK$NUM_PEAK: 25
PK$PEAK: m/z int. rel.int.
  27 14.4 144
  28 8.7 87
  29 5.2 52
  30 0.64 6
  31 3.9 39
  39 7.8 78
  40 1.7 17
  41 1.65 17
  42 26.1 261
  43 21.1 211
  44 7.3 73
  54 0.1 1
  55 1.4 14
  56 19.3 193
  57 3.6 36
  58 0.49 5
  59 99.99 999
  60 3.6 36
  70 0.9 9
  73 0.43 4
  84 1.4 14
  101 38.9 389
  102 2.7 27
  116 1.9 19
  117 2.2 22