ACCESSION: MSBNK-Fac_Eng_Univ_Tokyo-JP000388
RECORD_TITLE: 1,1-DIBUTYLHYDRAZINE; EI-B; MS
DATE: 2016.01.19 (Created 2008.10.21, modified 2011.05.06)
AUTHORS: SASAKI S, TOYOHASHI UNIV. OF TECH.
LICENSE: CC BY-NC-SA

CH$NAME: 1,1-DIBUTYLHYDRAZINE
CH$COMPOUND_CLASS: N/A
CH$FORMULA: C8H20N2
CH$EXACT_MASS: 144.16265
CH$SMILES: CCCCN(N)CCCC
CH$IUPAC: InChI=1S/C8H20N2/c1-3-5-7-10(9)8-6-4-2/h3-9H2,1-2H3
CH$LINK: INCHIKEY DJTIANXYHUNHQV-UHFFFAOYSA-N
CH$LINK: COMPTOX DTXSID7020217

AC$INSTRUMENT: SHIMADZU LKB-2091
AC$INSTRUMENT_TYPE: EI-B
AC$MASS_SPECTROMETRY: MS_TYPE MS
AC$MASS_SPECTROMETRY: ION_MODE POSITIVE
AC$MASS_SPECTROMETRY: IONIZATION_ENERGY 70 eV

MS$FOCUSED_ION: ION_TYPE [M]+*

PK$SPLASH: splash10-0udi-9700000000-2849b92f6877a0a2a5c2
PK$NUM_PEAK: 25
PK$PEAK: m/z int. rel.int.
  27 5.5 55
  28 3 30
  29 14.3 143
  30 0.35 4
  31 1.2 12
  39 2.6 26
  41 12.1 121
  42 0.37 4
  43 4.8 48
  44 4.5 45
  45 51.3 513
  46 0.29 3
  55 2 20
  56 1.2 12
  57 14.1 141
  58 0.18 2
  59 15.2 152
  70 1.2 12
  84 1.6 16
  86 0.12 1
  87 1 10
  101 99.99 999
  102 10.1 101
  144 1.77 18
  145 2.9 29