ACCESSION: MSBNK-Fac_Eng_Univ_Tokyo-JP000391
RECORD_TITLE: 1,1-HEXAMETHYLENEHYDRAZINE; EI-B; MS
DATE: 2016.01.19 (Created 2008.10.21, modified 2011.05.06)
AUTHORS: SASAKI S, TOYOHASHI UNIV. OF TECH.
LICENSE: CC BY-NC-SA

CH$NAME: 1,1-HEXAMETHYLENEHYDRAZINE
CH$NAME: 1-AMINOPERHYDROAZEPINE
CH$COMPOUND_CLASS: N/A
CH$FORMULA: C6H14N2
CH$EXACT_MASS: 114.11570
CH$SMILES: NN(C1)CCCCC1
CH$IUPAC: InChI=1S/C6H14N2/c7-8-5-3-1-2-4-6-8/h1-7H2
CH$LINK: INCHIKEY UGBKOURNNQREPE-UHFFFAOYSA-N
CH$LINK: COMPTOX DTXSID2073358

AC$INSTRUMENT: SHIMADZU LKB-2091
AC$INSTRUMENT_TYPE: EI-B
AC$MASS_SPECTROMETRY: MS_TYPE MS
AC$MASS_SPECTROMETRY: ION_MODE POSITIVE
AC$MASS_SPECTROMETRY: IONIZATION_ENERGY 70 eV

MS$FOCUSED_ION: ION_TYPE [M]+*

PK$SPLASH: splash10-01ow-9100000000-6a388ec9d5681b35dac6
PK$NUM_PEAK: 40
PK$PEAK: m/z int. rel.int.
  27 16.1 161
  29 10 100
  30 12.2 122
  31 0.29 3
  39 13.9 139
  40 2.8 28
  41 38.9 389
  42 5.61 56
  43 22.8 228
  44 55 550
  45 30 300
  46 0.54 5
  53 2.5 25
  54 2.7 27
  55 11.1 111
  56 0.71 7
  57 8.9 89
  58 28.9 289
  59 22.8 228
  60 0.22 2
  67 2.2 22
  68 4.4 44
  69 10.6 106
  70 0.38 4
  71 18.9 189
  72 28.3 283
  73 6.4 64
  82 0.16 2
  84 1.4 14
  85 50 500
  86 10.6 106
  87 0.11 1
  96 2 20
  97 1.4 14
  98 99.99 999
  99 6.44 64
  100 0.9 9
  113 23.3 233
  114 72.1 721
  115 11.1 111