ACCESSION: MSBNK-Fac_Eng_Univ_Tokyo-JP000401
RECORD_TITLE: 1,2-DIISOPROPYLHYDRAZINE; EI-B; MS
DATE: 2016.01.19 (Created 2008.10.21, modified 2011.05.06)
AUTHORS: SASAKI S, TOYOHASHI UNIV. OF TECH.
LICENSE: CC BY-NC-SA

CH$NAME: 1,2-DIISOPROPYLHYDRAZINE
CH$COMPOUND_CLASS: N/A
CH$FORMULA: C6H16N2
CH$EXACT_MASS: 116.13135
CH$SMILES: CC(C)NNC(C)C
CH$IUPAC: InChI=1S/C6H16N2/c1-5(2)7-8-6(3)4/h5-8H,1-4H3
CH$LINK: INCHIKEY QWLQTDXXEZQUBB-UHFFFAOYSA-N
CH$LINK: COMPTOX DTXSID10190608

AC$INSTRUMENT: SHIMADZU LKB-2091
AC$INSTRUMENT_TYPE: EI-B
AC$MASS_SPECTROMETRY: MS_TYPE MS
AC$MASS_SPECTROMETRY: ION_MODE POSITIVE
AC$MASS_SPECTROMETRY: IONIZATION_ENERGY 70 eV

MS$FOCUSED_ION: ION_TYPE [M]+*

PK$SPLASH: splash10-00l6-9200000000-ad76408317fa59e1f2ac
PK$NUM_PEAK: 28
PK$PEAK: m/z int. rel.int.
  27 17.5 175
  28 5.6 56
  29 4.6 46
  30 1.46 15
  31 99.99 999
  32 10.7 107
  39 7.3 73
  40 0.19 2
  41 25.2 252
  42 17.9 179
  43 76.4 764
  44 2.26 23
  45 1.3 13
  56 9.3 93
  57 3.5 35
  58 4.68 47
  59 44.4 444
  60 1.8 18
  72 1.2 12
  73 5.13 51
  74 3.8 38
  85 1.2 12
  99 1.1 11
  101 6.4 64
  102 4.8 48
  115 1.4 14
  116 64 640
  117 7.5 75