ACCESSION: MSBNK-Fac_Eng_Univ_Tokyo-JP000404
RECORD_TITLE: 1,2-DI-SEC-BUTYLHYDRAZINE; EI-B; MS
DATE: 2016.01.19 (Created 2008.10.21, modified 2011.05.06)
AUTHORS: SASAKI S, TOYOHASHI UNIV. OF TECH.
LICENSE: CC BY-NC-SA

CH$NAME: 1,2-DI-SEC-BUTYLHYDRAZINE
CH$COMPOUND_CLASS: N/A
CH$FORMULA: C8H20N2
CH$EXACT_MASS: 144.16265
CH$SMILES: CCC(C)NNC(C)CC
CH$IUPAC: InChI=1S/C8H20N2/c1-5-7(3)9-10-8(4)6-2/h7-10H,5-6H2,1-4H3
CH$LINK: INCHIKEY GTTATNIRHPAPPY-UHFFFAOYSA-N
CH$LINK: COMPTOX DTXSID30299102

AC$INSTRUMENT: SHIMADZU LKB-2091
AC$INSTRUMENT_TYPE: EI-B
AC$MASS_SPECTROMETRY: MS_TYPE MS
AC$MASS_SPECTROMETRY: ION_MODE POSITIVE
AC$MASS_SPECTROMETRY: IONIZATION_ENERGY 70 eV

MS$FOCUSED_ION: ION_TYPE [M]+*

PK$SPLASH: splash10-05mo-9300000000-29fda2cf86c772df6d58
PK$NUM_PEAK: 28
PK$PEAK: m/z int. rel.int.
  27 15.7 157
  29 39.5 395
  30 12.4 124
  31 3.43 34
  39 7.4 74
  41 31 310
  42 22 220
  43 0.85 9
  44 53.7 537
  45 3.2 32
  55 18.8 188
  56 0.84 8
  57 54.4 544
  58 8 80
  59 52.1 521
  70 0.77 8
  72 46.6 466
  73 6.6 66
  85 2.8 28
  87 1.63 16
  88 1.1 11
  99 0.7 7
  115 99.99 999
  116 1.01 10
  129 13.4 134
  130 1.1 11
  144 43.2 432
  145 6.5 65