ACCESSION: MSBNK-Fac_Eng_Univ_Tokyo-JP000413
RECORD_TITLE: TETRAETHYL-2-TETRAZENE; EI-B; MS
DATE: 2016.01.19 (Created 2008.10.21, modified 2011.05.06)
AUTHORS: SASAKI S, TOYOHASHI UNIV. OF TECH.
LICENSE: CC BY-NC-SA

CH$NAME: TETRAETHYL-2-TETRAZENE
CH$COMPOUND_CLASS: N/A
CH$FORMULA: C8H20N4
CH$EXACT_MASS: 172.16880
CH$SMILES: CCN(CC)N=NN(CC)CC
CH$IUPAC: InChI=1S/C8H20N4/c1-5-11(6-2)9-10-12(7-3)8-4/h5-8H2,1-4H3/b10-9+
CH$LINK: INCHIKEY DTPTYCXQWZYACS-MDZDMXLPSA-N

AC$INSTRUMENT: SHIMADZU LKB-2091
AC$INSTRUMENT_TYPE: EI-B
AC$MASS_SPECTROMETRY: MS_TYPE MS
AC$MASS_SPECTROMETRY: ION_MODE POSITIVE
AC$MASS_SPECTROMETRY: IONIZATION_ENERGY 70 eV

MS$FOCUSED_ION: ION_TYPE [M]+*

PK$SPLASH: splash10-002f-9100000000-f91ecbb1b97847323e06
PK$NUM_PEAK: 23
PK$PEAK: m/z int. rel.int.
  27 11.4 114
  28 10.2 102
  29 53.7 537
  30 0.52 5
  31 1.9 19
  41 1.6 16
  42 10.8 108
  43 0.45 5
  44 99.99 999
  45 2.7 27
  56 5.4 54
  57 0.37 4
  58 6.3 63
  59 4.5 45
  70 1 10
  71 0.11 1
  72 7.1 71
  73 0.8 8
  87 3.3 33
  100 0.25 3
  157 0.2 2
  172 42.2 422
  173 4.3 43