ACCESSION: MSBNK-Fac_Eng_Univ_Tokyo-JP000504
RECORD_TITLE: 1,1-DIMETHYL-2-PROPYLHYDRAZINE; EI-B; MS
DATE: 2016.01.19 (Created 2008.10.21, modified 2011.05.06)
AUTHORS: SASAKI S, TOYOHASHI UNIV. OF TECH.
LICENSE: CC BY-NC-SA

CH$NAME: 1,1-DIMETHYL-2-PROPYLHYDRAZINE
CH$COMPOUND_CLASS: N/A
CH$FORMULA: C5H14N2
CH$EXACT_MASS: 102.11570
CH$SMILES: CCCNN(C)C
CH$IUPAC: InChI=1S/C5H14N2/c1-4-5-6-7(2)3/h6H,4-5H2,1-3H3
CH$LINK: INCHIKEY OZBIETPCMMGBGS-UHFFFAOYSA-N

AC$INSTRUMENT: SHIMADZU LKB-2091
AC$INSTRUMENT_TYPE: EI-B
AC$MASS_SPECTROMETRY: MS_TYPE MS
AC$MASS_SPECTROMETRY: ION_MODE POSITIVE
AC$MASS_SPECTROMETRY: IONIZATION_ENERGY 70 eV

MS$FOCUSED_ION: ION_TYPE [M]+*

PK$SPLASH: splash10-0a4i-9100000000-b983c6c9f48eba50b540
PK$NUM_PEAK: 27
PK$PEAK: m/z int. rel.int.
  26 0.7 7
  27 5.6 56
  28 9.1 91
  29 0.33 3
  30 11.3 113
  31 1.1 11
  38 4.2 42
  39 0.14 1
  40 0.7 7
  41 4.9 49
  42 14.7 147
  43 1.28 13
  44 15.8 158
  45 16.9 169
  46 6 60
  56 0.09 1
  57 1.8 18
  58 2.5 25
  59 99.99 999
  60 0.39 4
  71 1.1 11
  72 0.7 7
  73 25.3 253
  74 0.11 1
  87 3.3 33
  102 38.1 381
  103 3.3 33