ACCESSION: MSBNK-Fac_Eng_Univ_Tokyo-JP000515
RECORD_TITLE: 1,1-DIETHYL-2-(1-METHYLPENTYL)HYDRAZINE; EI-B; MS
DATE: 2016.01.19 (Created 2008.10.21, modified 2011.05.06)
AUTHORS: SASAKI S, TOYOHASHI UNIV. OF TECH.
LICENSE: CC BY-NC-SA

CH$NAME: 1,1-DIETHYL-2-(1-METHYLPENTYL)HYDRAZINE
CH$COMPOUND_CLASS: N/A
CH$FORMULA: C10H24N2
CH$EXACT_MASS: 172.19395
CH$SMILES: CCCCC(C)NN(CC)CC
CH$IUPAC: InChI=1S/C10H24N2/c1-5-8-9-10(4)11-12(6-2)7-3/h10-11H,5-9H2,1-4H3
CH$LINK: INCHIKEY XDLSHZQLGZQWAF-UHFFFAOYSA-N

AC$INSTRUMENT: SHIMADZU LKB-2091
AC$INSTRUMENT_TYPE: EI-B
AC$MASS_SPECTROMETRY: MS_TYPE MS
AC$MASS_SPECTROMETRY: ION_MODE POSITIVE
AC$MASS_SPECTROMETRY: IONIZATION_ENERGY 70 eV

MS$FOCUSED_ION: ION_TYPE [M]+*

PK$SPLASH: splash10-000i-9000000000-79cb9c830ec6b6e6ce95
PK$NUM_PEAK: 33
PK$PEAK: m/z int. rel.int.
  27 4.6 46
  28 2.8 28
  29 9 90
  30 0.31 3
  31 3.4 34
  39 1.1 11
  41 4.7 47
  42 0.72 7
  43 8 80
  44 10.6 106
  45 1 10
  55 0.13 1
  56 2.7 27
  57 2.6 26
  58 3.9 39
  59 2.62 26
  60 1.2 12
  70 0.9 9
  71 1.2 12
  72 0.51 5
  73 6 60
  85 1.2 12
  86 0.6 6
  87 99.99 999
  88 7.2 72
  99 0.9 9
  100 1.1 11
  115 0.96 10
  116 0.8 8
  143 2.8 28
  157 4.1 41
  172 2.08 21
  173 3.3 33