ACCESSION: MSBNK-Fac_Eng_Univ_Tokyo-JP000566
RECORD_TITLE: UNDECANOIC ACID TRIMETHYLSILYL ESTER; EI-B; MS
DATE: 2016.01.19 (Created 2008.10.21, modified 2011.05.06)
AUTHORS: KOGA M, UNIV. OF OCCUPATIONAL AND ENVIRONMENTAL HEALTH
LICENSE: CC BY-NC-SA

CH$NAME: UNDECANOIC ACID TRIMETHYLSILYL ESTER
CH$COMPOUND_CLASS: N/A
CH$FORMULA: C14H30O2Si
CH$EXACT_MASS: 258.20151
CH$SMILES: CCCCCCCCCCC(=O)O[Si](C)(C)C
CH$IUPAC: InChI=1S/C14H30O2Si/c1-5-6-7-8-9-10-11-12-13-14(15)16-17(2,3)4/h5-13H2,1-4H3
CH$LINK: INCHIKEY PVQUEUNCRLSHJP-UHFFFAOYSA-N

AC$INSTRUMENT: JEOL JMS-01-SG
AC$INSTRUMENT_TYPE: EI-B
AC$MASS_SPECTROMETRY: MS_TYPE MS
AC$MASS_SPECTROMETRY: ION_MODE POSITIVE
AC$MASS_SPECTROMETRY: IONIZATION_ENERGY 70 eV

MS$FOCUSED_ION: ION_TYPE [M]+*

PK$SPLASH: splash10-00bc-9210000000-13f51ae4716da3969108
PK$NUM_PEAK: 23
PK$PEAK: m/z int. rel.int.
  43 65.5 655
  45 14.5 145
  47 17.7 177
  55 1.95 20
  56 7.4 74
  57 9.3 93
  67 7.1 71
  69 1.14 11
  73 88.5 885
  74 10.5 105
  75 99.99 999
  76 0.69 7
  77 22.3 223
  81 7.4 74
  83 7.1 71
  95 0.74 7
  117 64.9 649
  129 21.4 214
  131 13.9 139
  132 2.2 22
  145 13 130
  243 45.9 459
  244 6.8 68