ACCESSION: MSBNK-Fac_Eng_Univ_Tokyo-JP000929
RECORD_TITLE: TETRACHLOROMETHANE; EI-B; MS
DATE: 2016.01.19 (Created 2008.10.21, modified 2011.05.06)
AUTHORS: KOGA M, UNIV. OF OCCUPATIONAL AND ENVIRONMENTAL HEALTH
LICENSE: CC BY-NC-SA

CH$NAME: TETRACHLOROMETHANE
CH$NAME: CARBON TETRACHLORIDE
CH$COMPOUND_CLASS: N/A
CH$FORMULA: CCl4
CH$EXACT_MASS: 151.87541
CH$SMILES: ClC(Cl)(Cl)Cl
CH$IUPAC: InChI=1S/CCl4/c2-1(3,4)5
CH$LINK: CAS 56-23-5
CH$LINK: INCHIKEY VZGDMQKNWNREIO-UHFFFAOYSA-N
CH$LINK: COMPTOX DTXSID8020250

AC$INSTRUMENT: JEOL JMS-01-SG
AC$INSTRUMENT_TYPE: EI-B
AC$MASS_SPECTROMETRY: MS_TYPE MS
AC$MASS_SPECTROMETRY: ION_MODE POSITIVE
AC$MASS_SPECTROMETRY: IONIZATION_ENERGY 70 eV

MS$FOCUSED_ION: ION_TYPE [M]+*

PK$SPLASH: splash10-014i-3900000000-15e3b1fb84a75b2a20ee
PK$NUM_PEAK: 11
PK$PEAK: m/z int. rel.int.
  35 18.9 189
  37 6.2 62
  47 24.3 243
  49 0.86 9
  82 28.1 281
  84 17.9 179
  86 2.6 26
  117 99.99 999
  119 92.8 928
  121 30.1 301
  123 3.1 31