ACCESSION: MSBNK-Fac_Eng_Univ_Tokyo-JP000954
RECORD_TITLE: 1,2-DICHLOROETHANE; EI-B; MS
DATE: 2016.01.19 (Created 2008.10.21, modified 2011.05.06)
AUTHORS: KOGA M, UNIV. OF OCCUPATIONAL AND ENVIRONMENTAL HEALTH
LICENSE: CC BY-NC-SA

CH$NAME: 1,2-DICHLOROETHANE
CH$COMPOUND_CLASS: N/A
CH$FORMULA: C2H4Cl2
CH$EXACT_MASS: 97.96901
CH$SMILES: ClCCCl
CH$IUPAC: InChI=1S/C2H4Cl2/c3-1-2-4/h1-2H2
CH$LINK: CAS 107-06-2
CH$LINK: INCHIKEY WSLDOOZREJYCGB-UHFFFAOYSA-N
CH$LINK: COMPTOX DTXSID6020438

AC$INSTRUMENT: JEOL JMS-01-SG
AC$INSTRUMENT_TYPE: EI-B
AC$MASS_SPECTROMETRY: MS_TYPE MS
AC$MASS_SPECTROMETRY: ION_MODE POSITIVE
AC$MASS_SPECTROMETRY: IONIZATION_ENERGY 70 eV

MS$FOCUSED_ION: ION_TYPE [M]+*

PK$SPLASH: splash10-03di-9000000000-9bbb890df5219b043356
PK$NUM_PEAK: 18
PK$PEAK: m/z int. rel.int.
  25 3 30
  26 13.1 131
  27 39.8 398
  28 0.33 3
  35 4.2 42
  36 2.6 26
  47 2.1 21
  48 0.22 2
  49 24.9 249
  51 7.8 78
  60 3.2 32
  61 0.88 9
  62 99.99 999
  63 12.5 125
  64 31.1 311
  65 0.32 3
  98 7.3 73
  100 4.5 45