ACCESSION: MSBNK-Fac_Eng_Univ_Tokyo-JP000956
RECORD_TITLE: 1,1,2,2,-TETRACHLOROETHANE; EI-B; MS
DATE: 2016.01.19 (Created 2008.10.21, modified 2011.05.06)
AUTHORS: KOGA M, UNIV. OF OCCUPATIONAL AND ENVIRONMENTAL HEALTH
LICENSE: CC BY-NC-SA

CH$NAME: 1,1,2,2,-TETRACHLOROETHANE
CH$COMPOUND_CLASS: N/A
CH$FORMULA: C2H2Cl4
CH$EXACT_MASS: 165.89106
CH$SMILES: ClC(Cl)C(Cl)Cl
CH$IUPAC: InChI=1S/C2H2Cl4/c3-1(4)2(5)6/h1-2H
CH$LINK: CAS 79-34-5
CH$LINK: INCHIKEY QPFMBZIOSGYJDE-UHFFFAOYSA-N
CH$LINK: COMPTOX DTXSID7021318

AC$INSTRUMENT: JEOL JMS-01-SG
AC$INSTRUMENT_TYPE: EI-B
AC$MASS_SPECTROMETRY: MS_TYPE MS
AC$MASS_SPECTROMETRY: ION_MODE POSITIVE
AC$MASS_SPECTROMETRY: IONIZATION_ENERGY 70 eV

MS$FOCUSED_ION: ION_TYPE [M]+*

PK$SPLASH: splash10-001r-9100000000-4cc746f789afd4c17dca
PK$NUM_PEAK: 26
PK$PEAK: m/z int. rel.int.
  35 8.4 84
  36 2.6 26
  37 2.8 28
  45 0.2 2
  47 5.4 54
  48 4.1 41
  49 2.5 25
  60 1.41 14
  61 11.9 119
  62 4.6 46
  63 3.8 38
  83 99.99 999
  85 66.3 663
  87 9.8 98
  95 15.6 156
  96 1.11 11
  97 10.8 108
  98 6 60
  130 2.6 26
  131 0.87 9
  132 2.9 29
  133 8.4 84
  135 2.6 26
  166 0.77 8
  168 9.9 99
  170 4.1 41