ACCESSION: MSBNK-Fac_Eng_Univ_Tokyo-JP000967
RECORD_TITLE: DICHLORODIFLUOROMETHANE; EI-B; MS
DATE: 2016.01.19 (Created 2008.10.21, modified 2011.05.06)
AUTHORS: KOGA M, UNIV. OF OCCUPATIONAL AND ENVIRONMENTAL HEALTH
LICENSE: CC BY-NC-SA

CH$NAME: DICHLORODIFLUOROMETHANE
CH$COMPOUND_CLASS: N/A
CH$FORMULA: CCl2F2
CH$EXACT_MASS: 119.93451
CH$SMILES: FC(F)(Cl)Cl
CH$IUPAC: InChI=1S/CCl2F2/c2-1(3,4)5
CH$LINK: CAS 75-71-8
CH$LINK: INCHIKEY PXBRQCKWGAHEHS-UHFFFAOYSA-N
CH$LINK: COMPTOX DTXSID6020436

AC$INSTRUMENT: JEOL JMS-01-SG
AC$INSTRUMENT_TYPE: EI-B
AC$MASS_SPECTROMETRY: MS_TYPE MS
AC$MASS_SPECTROMETRY: ION_MODE POSITIVE
AC$MASS_SPECTROMETRY: IONIZATION_ENERGY 70 eV

MS$FOCUSED_ION: ION_TYPE [M]+*

PK$SPLASH: splash10-000i-9000000000-7ce8490add18c2d34cdb
PK$NUM_PEAK: 12
PK$PEAK: m/z int. rel.int.
  31 16.3 163
  35 22 220
  37 6.7 67
  47 0.87 9
  49 2.2 22
  50 24.6 246
  66 6.8 68
  68 0.21 2
  85 99.99 999
  87 30.9 309
  101 7.6 76
  103 4.3 43