ACCESSION: MSBNK-Fac_Eng_Univ_Tokyo-JP000968
RECORD_TITLE: BROMOMETHANE; EI-B; MS
DATE: 2016.01.19 (Created 2008.10.21, modified 2011.05.06)
AUTHORS: KOGA M, UNIV. OF OCCUPATIONAL AND ENVIRONMENTAL HEALTH
LICENSE: CC BY-NC-SA

CH$NAME: BROMOMETHANE
CH$COMPOUND_CLASS: N/A
CH$FORMULA: CH3Br
CH$EXACT_MASS: 93.94181
CH$SMILES: CBr
CH$IUPAC: InChI=1S/CH3Br/c1-2/h1H3
CH$LINK: CAS 74-83-9
CH$LINK: INCHIKEY GZUXJHMPEANEGY-UHFFFAOYSA-N
CH$LINK: COMPTOX DTXSID8020832

AC$INSTRUMENT: JEOL JMS-01-SG
AC$INSTRUMENT_TYPE: EI-B
AC$MASS_SPECTROMETRY: MS_TYPE MS
AC$MASS_SPECTROMETRY: ION_MODE POSITIVE
AC$MASS_SPECTROMETRY: IONIZATION_ENERGY 70 eV

MS$FOCUSED_ION: ION_TYPE [M]+*

PK$SPLASH: splash10-0007-9000000000-745f8b23626d21db04f3
PK$NUM_PEAK: 10
PK$PEAK: m/z int. rel.int.
  79 21.3 213
  80 4.3 43
  81 20.5 205
  82 0.39 4
  91 9 90
  92 4.3 43
  93 21.6 216
  94 99.99 999
  95 14.1 141
  96 89.3 893