ACCESSION: MSBNK-Fac_Eng_Univ_Tokyo-JP001240
RECORD_TITLE: 1,2,3,4-TETRAHYDRO-CIS-2-PHENYL-1-NAPHTHYLACETATE; EI-B; MS
DATE: 2016.01.19 (Created 2008.10.21, modified 2011.05.06)
AUTHORS: SASAKI S, TOYOHASHI UNIV. OF TECH.
LICENSE: CC BY-NC-SA

CH$NAME: 1,2,3,4-TETRAHYDRO-CIS-2-PHENYL-1-NAPHTHYLACETATE
CH$COMPOUND_CLASS: N/A
CH$FORMULA: C18H18O2
CH$EXACT_MASS: 266.13068
CH$SMILES: N/A
CH$IUPAC: N/A

AC$INSTRUMENT: HITACHI RMU-6D
AC$INSTRUMENT_TYPE: EI-B
AC$MASS_SPECTROMETRY: MS_TYPE MS
AC$MASS_SPECTROMETRY: ION_MODE POSITIVE
AC$MASS_SPECTROMETRY: IONIZATION_ENERGY 70 eV

MS$FOCUSED_ION: ION_TYPE [M]+*

PK$SPLASH: splash10-0a4l-9680000000-55eddb7242a0e3c5bc3b
PK$NUM_PEAK: 76
PK$PEAK: m/z int. rel.int.
  15 1 10
  18 1 10
  28 1 10
  39 0.17 2
  43 26 260
  45 4 40
  51 3 30
  60 0.23 2
  63 2 20
  65 6 60
  75 1 10
  76 0.23 2
  77 7 70
  78 3 30
  88 2 20
  89 0.6 6
  90 2 20
  91 86.7 867
  92 7 70
  95 0.1 1
  101 5 50
  102 3 30
  103 4.7 47
  104 0.7 7
  105 3 30
  107 11.3 113
  115 10 100
  116 0.07 1
  117 5 50
  118 2 20
  119 15.3 153
  120 4.4 44
  121 3 30
  126 0.7 7
  127 5 50
  128 1.8 18
  129 9.7 97
  130 1 10
  131 1.4 14
  133 0.07 1
  134 0.7 7
  139 0.7 7
  141 0.7 7
  145 0.03 0
  146 1.7 17
  147 0.3 3
  151 0.7 7
  152 0.17 2
  153 0.3 3
  154 0.3 3
  162 1.7 17
  163 0.03 0
  164 0.3 3
  165 2 20
  166 0.3 3
  176 0.13 1
  177 1 10
  178 4 40
  179 2 20
  189 0.4 4
  190 3 30
  191 8 80
  192 1 10
  196 0.1 1
  200 1 10
  201 1 10
  202 6.3 63
  203 0.5 5
  204 4 40
  205 13 130
  206 99.99 999
  207 1.8 18
  208 1.3 13
  223 1 10
  224 8.7 87
  225 1.3 13