ACCESSION: MSBNK-Fac_Eng_Univ_Tokyo-JP001379
RECORD_TITLE: (E)-1,4-DICHLORO-2-TRIMETHYLSILYL-2-BUTENE; EI-B; MS
DATE: 2016.01.19 (Created 2008.10.21, modified 2011.05.06)
AUTHORS: MASS SPECTROSCOPY SOC. OF JAPAN (MSSJ)
LICENSE: CC BY-NC-SA

CH$NAME: (E)-1,4-DICHLORO-2-TRIMETHYLSILYL-2-BUTENE
CH$COMPOUND_CLASS: N/A
CH$FORMULA: C7H14Cl2Si
CH$EXACT_MASS: 196.02418
CH$SMILES: N/A
CH$IUPAC: N/A

AC$INSTRUMENT: JEOL JMS-D-3000
AC$INSTRUMENT_TYPE: EI-B
AC$MASS_SPECTROMETRY: MS_TYPE MS
AC$MASS_SPECTROMETRY: ION_MODE POSITIVE
AC$MASS_SPECTROMETRY: IONIZATION_ENERGY 70 eV

MS$FOCUSED_ION: ION_TYPE [M]+*

PK$SPLASH: splash10-0udi-9000000000-29650d9e34d1f9ec4c27
PK$NUM_PEAK: 22
PK$PEAK: m/z int. rel.int.
  43 3.49 35
  45 3.78 38
  51 1.58 16
  52 3.08 31
  53 99.99 999
  54 4.68 47
  63 2.25 23
  65 3.71 37
  67 1.02 10
  73 20.91 209
  75 1.29 13
  79 2.24 22
  88 6.17 62
  90 2.25 23
  93 47.03 470
  94 3.82 38
  95 17.39 174
  96 1.31 13
  113 1.43 14
  115 1.02 10
  181 3.71 37
  183 2.73 27