ACCESSION: MSBNK-Fac_Eng_Univ_Tokyo-JP001382
RECORD_TITLE: 1,1-BIS(TRIMETHYLSILYL)ETHYLENE; EI-B; MS
DATE: 2016.01.19 (Created 2008.10.21, modified 2011.05.06)
AUTHORS: MASS SPECTROSCOPY SOC. OF JAPAN (MSSJ)
LICENSE: CC BY-NC-SA

CH$NAME: 1,1-BIS(TRIMETHYLSILYL)ETHYLENE
CH$COMPOUND_CLASS: N/A
CH$FORMULA: C8H20Si2
CH$EXACT_MASS: 172.11035
CH$SMILES: C[Si](C)(C)C(=C)[Si](C)(C)C
CH$IUPAC: InChI=1S/C8H20Si2/c1-8(9(2,3)4)10(5,6)7/h1H2,2-7H3
CH$LINK: INCHIKEY CVCQWLSMIOKNLE-UHFFFAOYSA-N
CH$LINK: COMPTOX DTXSID70205101

AC$INSTRUMENT: JEOL JMS-D-3000
AC$INSTRUMENT_TYPE: EI-B
AC$MASS_SPECTROMETRY: MS_TYPE MS
AC$MASS_SPECTROMETRY: ION_MODE POSITIVE
AC$MASS_SPECTROMETRY: IONIZATION_ENERGY 70 eV

MS$FOCUSED_ION: ION_TYPE [M]+*

PK$SPLASH: splash10-00di-9200000000-7bc498e66838fd6ea846
PK$NUM_PEAK: 19
PK$PEAK: m/z int. rel.int.
  43 5.48 55
  45 12.14 121
  55 1.52 15
  58 2.59 26
  59 4.92 49
  69 1.01 10
  73 99.99 999
  74 8.71 87
  75 3.85 39
  83 4.72 47
  84 6.37 64
  85 1.18 12
  98 1.2 12
  99 2.74 27
  157 23.85 239
  158 4.24 42
  159 1.94 19
  172 7.2 72
  173 1.4 14