ACCESSION: MSBNK-Fac_Eng_Univ_Tokyo-JP001575
RECORD_TITLE: ETHYLENE-OXIDE; EI-B; MS
DATE: 2016.01.19 (Created 2008.10.21, modified 2011.05.06)
AUTHORS: MASS SPECTROSCOPY SOC. OF JAPAN (MSSJ)
LICENSE: CC BY-NC-SA

CH$NAME: ETHYLENE-OXIDE
CH$NAME: OXIRANE
CH$COMPOUND_CLASS: N/A
CH$FORMULA: C2H4O
CH$EXACT_MASS: 44.02621
CH$SMILES: C(C1)O1
CH$IUPAC: InChI=1S/C2H4O/c1-2-3-1/h1-2H2
CH$LINK: CAS 75-21-8
CH$LINK: INCHIKEY IAYPIBMASNFSPL-UHFFFAOYSA-N
CH$LINK: COMPTOX DTXSID0020600

AC$INSTRUMENT: HITACHI RMU-5B
AC$INSTRUMENT_TYPE: EI-B
AC$MASS_SPECTROMETRY: MS_TYPE MS
AC$MASS_SPECTROMETRY: ION_MODE POSITIVE
AC$MASS_SPECTROMETRY: IONIZATION_ENERGY 80 eV

MS$FOCUSED_ION: ION_TYPE [M]+*

PK$SPLASH: splash10-00ou-9000000000-5d524d3951f924d0d702
PK$NUM_PEAK: 14
PK$PEAK: m/z int. rel.int.
  12 2.68 27
  14 21.78 218
  15 54.18 542
  16 7.24 72
  26 5.87 59
  27 4.23 42
  28 5.82 58
  29 99.99 999
  30 2.34 23
  41 1.33 13
  42 12.01 120
  43 15.66 157
  44 61.78 618
  45 1.48 15