ACCESSION: MSBNK-Fac_Eng_Univ_Tokyo-JP001576
RECORD_TITLE: CARBON-DIOXIDE; EI-B; MS
DATE: 2016.01.19 (Created 2008.10.21, modified 2011.05.06)
AUTHORS: MASS SPECTROSCOPY SOC. OF JAPAN (MSSJ)
LICENSE: CC BY-NC-SA

CH$NAME: CARBON-DIOXIDE
CH$COMPOUND_CLASS: N/A
CH$FORMULA: CO2
CH$EXACT_MASS: 43.98983
CH$SMILES: O=C=O
CH$IUPAC: InChI=1S/CO2/c2-1-3
CH$LINK: CAS 124-38-9
CH$LINK: INCHIKEY CURLTUGMZLYLDI-UHFFFAOYSA-N
CH$LINK: COMPTOX DTXSID4027028

AC$INSTRUMENT: HITACHI RMU-5B
AC$INSTRUMENT_TYPE: EI-B
AC$MASS_SPECTROMETRY: MS_TYPE MS
AC$MASS_SPECTROMETRY: ION_MODE POSITIVE
AC$MASS_SPECTROMETRY: IONIZATION_ENERGY 80 eV

MS$FOCUSED_ION: ION_TYPE [M]+*

PK$SPLASH: splash10-0006-9000000000-ffb540455919d1e43969
PK$NUM_PEAK: 6
PK$PEAK: m/z int. rel.int.
  12 5.35 54
  16 9.25 93
  22 1.75 18
  28 12.67 127
  44 99.99 999
  45 1.27 13