ACCESSION: MSBNK-Fac_Eng_Univ_Tokyo-JP001590
RECORD_TITLE: 1,2-DIMETHYLNAPHTHALENE; EI-B; MS
DATE: 2016.01.19 (Created 2008.10.21, modified 2011.05.06)
AUTHORS: KOGA M, UNIV. OF OCCUPATIONAL AND ENVIRONMENTAL HEALTH
LICENSE: CC BY-NC-SA

CH$NAME: 1,2-DIMETHYLNAPHTHALENE
CH$COMPOUND_CLASS: N/A
CH$FORMULA: C12H12
CH$EXACT_MASS: 156.09390
CH$SMILES: Cc(c1)c(C)c(c2)c(ccc2)c1
CH$IUPAC: InChI=1S/C12H12/c1-9-7-8-11-5-3-4-6-12(11)10(9)2/h3-8H,1-2H3
CH$LINK: CAS 573-98-8
CH$LINK: INCHIKEY QNLZIZAQLLYXTC-UHFFFAOYSA-N
CH$LINK: COMPTOX DTXSID1058717

AC$INSTRUMENT: VARIAN MAT-44
AC$INSTRUMENT_TYPE: EI-B
AC$MASS_SPECTROMETRY: MS_TYPE MS
AC$MASS_SPECTROMETRY: ION_MODE POSITIVE
AC$MASS_SPECTROMETRY: IONIZATION_ENERGY 70 eV

MS$FOCUSED_ION: ION_TYPE [M]+*

PK$SPLASH: splash10-0pdl-7900000000-a3e1e81ae1e81ac63c5d
PK$NUM_PEAK: 50
PK$PEAK: m/z int. rel.int.
  41 2.64 26
  49 1.32 13
  50 22.6 226
  51 43.56 436
  52 8.58 86
  53 3.79 38
  57 3.46 35
  58 4.95 50
  61 3.46 35
  62 14.19 142
  63 38.44 384
  64 16.5 165
  65 7.59 76
  69 2.31 23
  70 6.43 64
  71 5.11 51
  74 11.88 119
  75 14.19 142
  76 26.73 267
  77 27.22 272
  78 12.21 122
  86 3.79 38
  87 5.61 56
  88 2.31 23
  89 7.92 79
  91 1.81 18
  98 1.98 20
  99 1.15 12
  101 1.98 20
  102 4.95 50
  113 2.31 23
  114 2.97 30
  115 33.82 338
  116 3.96 40
  126 3.63 36
  127 9.73 97
  128 18.48 185
  129 7.09 71
  139 7.59 76
  140 7.75 78
  141 99.99 999
  142 14.19 142
  143 1.15 12
  151 3.63 36
  152 10.23 102
  153 10.72 107
  154 6.43 64
  155 23.43 234
  156 89.43 894
  157 13.2 132