ACCESSION: MSBNK-Fac_Eng_Univ_Tokyo-JP001833
RECORD_TITLE: OCTANOIC ACID METHYL ESTER; EI-B; MS
DATE: 2016.01.19 (Created 2008.10.21, modified 2011.05.06)
AUTHORS: TAJIMA S, GUNMA COLLEGE OF TECHNOLOGY
LICENSE: CC BY-NC-SA

CH$NAME: OCTANOIC ACID METHYL ESTER
CH$COMPOUND_CLASS: N/A
CH$FORMULA: C9H18O2
CH$EXACT_MASS: 158.13068
CH$SMILES: N/A
CH$IUPAC: N/A

AC$INSTRUMENT: HITACHI RMU-7M
AC$INSTRUMENT_TYPE: EI-B
AC$MASS_SPECTROMETRY: MS_TYPE MS
AC$MASS_SPECTROMETRY: ION_MODE POSITIVE
AC$MASS_SPECTROMETRY: IONIZATION_ENERGY 70 eV

MS$FOCUSED_ION: ION_TYPE [M]+*

PK$SPLASH: splash10-00di-9000000000-10f680758af5d131c339
PK$NUM_PEAK: 34
PK$PEAK: m/z int. rel.int.
  15 6.6 66
  27 8.61 86
  28 3.2 32
  29 11.67 117
  39 5.94 59
  41 18.95 190
  42 6.27 63
  43 29.42 294
  44 1.27 13
  45 1.6 16
  53 1.33 13
  55 18.01 180
  56 3.14 31
  57 17.41 174
  59 13.08 131
  67 1.27 13
  69 6.27 63
  70 1.4 14
  73 2 20
  74 99.99 999
  75 6.8 68
  83 2.67 27
  84 3.14 31
  87 39.69 397
  88 3.94 39
  97 1.47 15
  98 1.53 15
  101 5.94 59
  115 6.54 65
  127 9.21 92
  128 1 10
  129 2.74 27
  158 0.6 6
  159 1 10