ACCESSION: MSBNK-Fac_Eng_Univ_Tokyo-JP002098
RECORD_TITLE: 1,2-DICHLOROETHANE; EI-B; MS
DATE: 2016.01.19 (Created 2008.10.21, modified 2011.05.06)
AUTHORS: TAJIMA S, GUNMA COLLEGE OF TECHNOLOGY
LICENSE: CC BY-NC-SA

CH$NAME: 1,2-DICHLOROETHANE
CH$COMPOUND_CLASS: N/A
CH$FORMULA: C2H4Cl2
CH$EXACT_MASS: 97.96901
CH$SMILES: ClCCCl
CH$IUPAC: InChI=1S/C2H4Cl2/c3-1-2-4/h1-2H2
CH$LINK: INCHIKEY WSLDOOZREJYCGB-UHFFFAOYSA-N
CH$LINK: COMPTOX DTXSID6020438

AC$INSTRUMENT: HITACHI RMU-7M
AC$INSTRUMENT_TYPE: EI-B
AC$MASS_SPECTROMETRY: MS_TYPE MS
AC$MASS_SPECTROMETRY: ION_MODE POSITIVE
AC$MASS_SPECTROMETRY: IONIZATION_ENERGY 70 eV

MS$FOCUSED_ION: ION_TYPE [M]+*

PK$SPLASH: splash10-03fr-9000000000-19f59c151d600b711587
PK$NUM_PEAK: 20
PK$PEAK: m/z int. rel.int.
  25 3.01 30
  26 14.19 142
  27 77.23 772
  28 1.47 15
  35 1.85 19
  36 1.74 17
  47 1.74 17
  48 2.32 23
  49 41.31 413
  50 1.22 12
  51 12.86 129
  60 3.13 31
  61 12.75 128
  62 99.99 999
  63 22.6 226
  64 32.5 325
  65 6.08 61
  98 10.08 101
  100 6.37 64
  102 1.1 11