ACCESSION: MSBNK-Fac_Eng_Univ_Tokyo-JP002105
RECORD_TITLE: CHLOROFORM; EI-B; MS
DATE: 2016.01.19 (Created 2008.10.21, modified 2011.05.06)
AUTHORS: TAJIMA S, GUNMA COLLEGE OF TECHNOLOGY
LICENSE: CC BY-NC-SA

CH$NAME: CHLOROFORM
CH$COMPOUND_CLASS: N/A
CH$FORMULA: CHCl3
CH$EXACT_MASS: 117.91438
CH$SMILES: ClC(Cl)Cl
CH$IUPAC: InChI=1S/CHCl3/c2-1(3)4/h1H
CH$LINK: INCHIKEY HEDRZPFGACZZDS-UHFFFAOYSA-N
CH$LINK: COMPTOX DTXSID1020306

AC$INSTRUMENT: HITACHI RMU-7M
AC$INSTRUMENT_TYPE: EI-B
AC$MASS_SPECTROMETRY: MS_TYPE MS
AC$MASS_SPECTROMETRY: ION_MODE POSITIVE
AC$MASS_SPECTROMETRY: IONIZATION_ENERGY 70 eV

MS$FOCUSED_ION: ION_TYPE [M]+*

PK$SPLASH: splash10-001r-9000000000-375900f120fe0ebf7c58
PK$NUM_PEAK: 17
PK$PEAK: m/z int. rel.int.
  35 4.16 42
  36 1.68 17
  37 1.52 15
  47 21.02 210
  48 9.91 99
  49 7.11 71
  50 3.28 33
  82 3.52 35
  83 99.99 999
  84 3.36 34
  85 64.27 643
  86 1.12 11
  87 10.31 103
  117 1.12 11
  118 1.76 18
  119 1.12 11
  120 1.52 15