ACCESSION: MSBNK-Fac_Eng_Univ_Tokyo-JP002137
RECORD_TITLE: 1,2-DIMETHOXYETHANE; EI-B; MS
DATE: 2016.01.19 (Created 2008.10.21, modified 2011.05.06)
AUTHORS: TAJIMA S, GUNMA COLLEGE OF TECHNOLOGY
LICENSE: CC BY-NC-SA

CH$NAME: 1,2-DIMETHOXYETHANE
CH$COMPOUND_CLASS: N/A
CH$FORMULA: C4H10O2
CH$EXACT_MASS: 90.06808
CH$SMILES: COCCOC
CH$IUPAC: InChI=1S/C4H10O2/c1-5-3-4-6-2/h3-4H2,1-2H3
CH$LINK: INCHIKEY XTHFKEDIFFGKHM-UHFFFAOYSA-N
CH$LINK: COMPTOX DTXSID0025286

AC$INSTRUMENT: HITACHI RMU-7M
AC$INSTRUMENT_TYPE: EI-B
AC$MASS_SPECTROMETRY: MS_TYPE MS
AC$MASS_SPECTROMETRY: ION_MODE POSITIVE
AC$MASS_SPECTROMETRY: IONIZATION_ENERGY 70 eV

MS$FOCUSED_ION: ION_TYPE [M]+*

PK$SPLASH: splash10-0002-9000000000-256f9da6e8dd5f90a080
PK$NUM_PEAK: 13
PK$PEAK: m/z int. rel.int.
  15 7.89 79
  27 1.38 14
  28 4.5 45
  29 10.15 102
  31 4.07 41
  43 2.57 26
  44 1.13 11
  45 99.99 999
  46 2.13 21
  58 5.39 54
  59 2.51 25
  60 14.97 150
  90 6.14 61