ACCESSION: MSBNK-Fac_Eng_Univ_Tokyo-JP002560
RECORD_TITLE: DIETHYLAMINE; EI-B; MS
DATE: 2016.01.19 (Created 2008.10.21, modified 2011.05.06)
AUTHORS: YAMAMOTO M, DEP. CHEMISTRY, FAC. SCIENCE, NARA WOMEN'S UNIV.
LICENSE: CC BY-NC-SA

CH$NAME: DIETHYLAMINE
CH$COMPOUND_CLASS: N/A
CH$FORMULA: C4H11N
CH$EXACT_MASS: 73.08915
CH$SMILES: CCNCC
CH$IUPAC: InChI=1S/C4H11N/c1-3-5-4-2/h5H,3-4H2,1-2H3
CH$LINK: INCHIKEY HPNMFZURTQLUMO-UHFFFAOYSA-N
CH$LINK: COMPTOX DTXSID6021909

AC$INSTRUMENT: HITACHI RMU-6M
AC$INSTRUMENT_TYPE: EI-B
AC$MASS_SPECTROMETRY: MS_TYPE MS
AC$MASS_SPECTROMETRY: ION_MODE POSITIVE
AC$MASS_SPECTROMETRY: IONIZATION_ENERGY 70 eV

MS$FOCUSED_ION: ION_TYPE [M]+*

PK$SPLASH: splash10-0a59-9000000000-52bf754cf3d4f70f7ad9
PK$NUM_PEAK: 19
PK$PEAK: m/z int. rel.int.
  15 5.47 55
  26 2.62 26
  27 14.96 150
  28 16.57 166
  29 14.91 149
  30 82.54 825
  31 1.09 11
  40 1.45 15
  41 3.4 34
  42 9.74 97
  43 2.82 28
  44 28.74 287
  56 3.54 35
  57 1.41 14
  58 99.99 999
  59 3.54 35
  72 16.66 167
  73 28.76 288
  74 1.45 15