ACCESSION: MSBNK-Fac_Eng_Univ_Tokyo-JP002747
RECORD_TITLE: TRIMETHYLSILYL THREO-SPHINGANINE; EI-B; MS
DATE: 2016.01.19 (Created 2008.10.21, modified 2011.05.06)
AUTHORS: HAYASHI A, DEPT. OF CHEMISTRY, FAC. OF SCI. AND TECHNOLOGY, KINKI UNIV.
LICENSE: CC BY-NC-SA

CH$NAME: TRIMETHYLSILYL THREO-SPHINGANINE
CH$COMPOUND_CLASS: N/A
CH$FORMULA: C24H55NO2Si2
CH$EXACT_MASS: 445.37713
CH$SMILES: N/A
CH$IUPAC: N/A

AC$INSTRUMENT: SHIMADZU LKB-9000B
AC$INSTRUMENT_TYPE: EI-B
AC$MASS_SPECTROMETRY: MS_TYPE MS
AC$MASS_SPECTROMETRY: ION_MODE POSITIVE
AC$MASS_SPECTROMETRY: IONIZATION_ENERGY 23 eV

MS$FOCUSED_ION: ION_TYPE [M]+*

PK$SPLASH: splash10-001i-5903000000-f9e238243e991ba165b9
PK$NUM_PEAK: 57
PK$PEAK: m/z int. rel.int.
  36 1.4 14
  40 1.7 17
  43 1.8 18
  47 1.1 11
  55 1.3 13
  56 1.7 17
  57 4 40
  67 0.16 2
  68 2.7 27
  69 3 30
  70 2.2 22
  71 0.22 2
  73 2.8 28
  74 1.2 12
  75 25.5 255
  76 0.19 2
  77 2.1 21
  81 1.9 19
  82 5.9 59
  83 0.9 9
  84 1.7 17
  85 6 60
  91 1.4 14
  93 0.2 2
  95 2.6 26
  96 4 40
  97 3.5 35
  103 0.17 2
  108 0.3 3
  109 1.8 18
  110 1.7 17
  111 0.17 2
  116 6.9 69
  117 1.3 13
  129 8.1 81
  130 0.14 1
  131 8 80
  132 99.99 999
  133 10.7 107
  134 0.4 4
  147 0.9 9
  149 1.4 14
  185 1.1 11
  217 0.12 1
  219 1.2 12
  221 0.2 2
  252 1.7 17
  297 0.14 1
  309 1.1 11
  313 4.6 46
  314 1.4 14
  340 0.17 2
  342 34.7 347
  343 8.5 85
  344 2.2 22
  428 0.2 2
  430 0.5 5