ACCESSION: MSBNK-Fac_Eng_Univ_Tokyo-JP003112
RECORD_TITLE: TRIFLUPROMAZINE; EI-B; MS
DATE: 2016.01.19 (Created 2008.10.21, modified 2011.05.06)
AUTHORS: SASAKI S, TOYOHASHI UNIV. OF TECH.
LICENSE: CC BY-NC-SA

CH$NAME: TRIFLUPROMAZINE
CH$COMPOUND_CLASS: N/A
CH$FORMULA: C18H19F3N2S
CH$EXACT_MASS: 352.1221
CH$SMILES: N/A
CH$IUPAC: N/A

AC$INSTRUMENT: Unknown
AC$INSTRUMENT_TYPE: EI-B
AC$MASS_SPECTROMETRY: MS_TYPE MS
AC$MASS_SPECTROMETRY: ION_MODE POSITIVE

MS$FOCUSED_ION: ION_TYPE [M]+*

PK$SPLASH: splash10-0a4l-9000000000-50190a53c0911d0b8efd
PK$NUM_PEAK: 39
PK$PEAK: m/z int. rel.int.
  39 7.9 79
  41 23.9 239
  42 11.9 119
  43 2.29 23
  44 31.9 319
  55 19.9 199
  56 7.9 79
  57 2.89 29
  58 99.99 999
  67 6.9 69
  69 13.9 139
  70 0.89 9
  71 13.9 139
  72 15.9 159
  81 6.9 69
  83 0.89 9
  84 5.9 59
  85 14.9 149
  86 12.9 129
  95 0.69 7
  97 6.9 69
  111 4.9 49
  113 2.9 29
  123 0.19 2
  125 1.9 19
  149 1.9 19
  196 1.9 19
  197 0.19 2
  198 0.9 9
  202 0.9 9
  232 0.9 9
  248 0.39 4
  266 4.9 49
  267 2.9 29
  280 1.9 19
  306 0.59 6
  307 2.9 29
  338 0.9 9
  352 7.9 79