ACCESSION: MSBNK-Fac_Eng_Univ_Tokyo-JP003198
RECORD_TITLE: ETHYL P-AMINOBENZOATE; EI-B; MS
DATE: 2016.01.19 (Created 2008.10.21, modified 2011.05.06)
AUTHORS: NAKATA H, DEPT. OF CHEMISTRY, AICHI KYOIKU UNIV.
LICENSE: CC BY-NC-SA

CH$NAME: ETHYL P-AMINOBENZOATE
CH$COMPOUND_CLASS: N/A
CH$FORMULA: C9H11NO2
CH$EXACT_MASS: 165.07898
CH$SMILES: CCOC(=O)c(c1)ccc(N)c1
CH$IUPAC: InChI=1S/C9H11NO2/c1-2-12-9(11)7-3-5-8(10)6-4-7/h3-6H,2,10H2,1H3
CH$LINK: INCHIKEY BLFLLBZGZJTVJG-UHFFFAOYSA-N
CH$LINK: COMPTOX DTXSID8021804

AC$INSTRUMENT: HITACHI RMU-6D
AC$INSTRUMENT_TYPE: EI-B
AC$MASS_SPECTROMETRY: MS_TYPE MS
AC$MASS_SPECTROMETRY: ION_MODE POSITIVE
AC$MASS_SPECTROMETRY: IONIZATION_ENERGY 70 eV

MS$FOCUSED_ION: ION_TYPE [M]+*

PK$SPLASH: splash10-0109-9400000000-c755b4e5336a2867357e
PK$NUM_PEAK: 27
PK$PEAK: m/z int. rel.int.
  26 13 130
  27 35 350
  28 20 200
  29 31 310
  30 7 70
  37 7 70
  38 11 110
  39 33 330
  40 11 110
  41 15 150
  52 12 120
  62 8 80
  63 20 200
  64 14 140
  65 64 640
  66 13 130
  91 7 70
  92 44 440
  93 10 100
  119 5 50
  120 99.99 999
  121 13 130
  122 4 40
  137 20 200
  138 4 40
  165 22 220
  166 4 40