ACCESSION: MSBNK-Fac_Eng_Univ_Tokyo-JP003247
RECORD_TITLE: 1,1'-(2,2,2-TRICHLOROETHYLIDENE)-BIS(4-CHLOROBENZENE); EI-B; MS
DATE: 2016.01.19 (Created 2008.10.21, modified 2011.05.06)
AUTHORS: MASS SPECTROSCOPY SOC. OF JAPAN (MSSJ)
LICENSE: CC BY-NC-SA

CH$NAME: 1,1'-(2,2,2-TRICHLOROETHYLIDENE)-BIS(4-CHLOROBENZENE)
CH$COMPOUND_CLASS: N/A
CH$FORMULA: C14H9Cl5
CH$EXACT_MASS: 351.91469
CH$SMILES: Clc(c2)ccc(c2)C(c(c1)ccc(Cl)c1)C(Cl)(Cl)Cl
CH$IUPAC: InChI=1S/C14H9Cl5/c15-11-5-1-9(2-6-11)13(14(17,18)19)10-3-7-12(16)8-4-10/h1-8,13H
CH$LINK: INCHIKEY YVGGHNCTFXOJCH-UHFFFAOYSA-N
CH$LINK: COMPTOX DTXSID4020375

AC$INSTRUMENT: HITACHI RMU-6E
AC$INSTRUMENT_TYPE: EI-B
AC$MASS_SPECTROMETRY: MS_TYPE MS
AC$MASS_SPECTROMETRY: ION_MODE POSITIVE
AC$MASS_SPECTROMETRY: IONIZATION_ENERGY 70 eV

MS$FOCUSED_ION: ION_TYPE [M]+*

PK$SPLASH: splash10-000i-0390000000-a23b93b08974f28c17ea
PK$NUM_PEAK: 14
PK$PEAK: m/z int. rel.int.
  165 59 590
  176 15 150
  199 17 170
  212 13 130
  235 99.99 999
  237 82 820
  282 5.7 57
  283 2.8 28
  284 5.8 58
  316 5.9 59
  318 6.9 69
  352 2 20
  354 2.6 26
  356 2 20