ACCESSION: MSBNK-Fac_Eng_Univ_Tokyo-JP003262
RECORD_TITLE: 2-BENZYL IMIDAZOLINE; EI-B; MS
DATE: 2016.01.19 (Created 2008.10.21, modified 2011.05.06)
AUTHORS: MASS SPECTROSCOPY SOC. OF JAPAN (MSSJ)
LICENSE: CC BY-NC-SA

CH$NAME: 2-BENZYL IMIDAZOLINE
CH$COMPOUND_CLASS: N/A
CH$FORMULA: C10H12N2
CH$EXACT_MASS: 160.10005
CH$SMILES: c(c2)ccc(c2)CC(N1)=NCC1
CH$IUPAC: InChI=1S/C10H12N2/c1-2-4-9(5-3-1)8-10-11-6-7-12-10/h1-5H,6-8H2,(H,11,12)
CH$LINK: INCHIKEY JIVZKJJQOZQXQB-UHFFFAOYSA-N
CH$LINK: COMPTOX DTXSID3023683

AC$INSTRUMENT: HITACHI RMU-7
AC$INSTRUMENT_TYPE: EI-B
AC$MASS_SPECTROMETRY: MS_TYPE MS
AC$MASS_SPECTROMETRY: ION_MODE POSITIVE
AC$MASS_SPECTROMETRY: IONIZATION_ENERGY 70 eV

MS$FOCUSED_ION: ION_TYPE [M]+*

PK$SPLASH: splash10-0006-9400000000-7b6f1c4b249d1fba8927
PK$NUM_PEAK: 17
PK$PEAK: m/z int. rel.int.
  41 7 70
  42 9 90
  51 12 120
  63 8 80
  65 21 210
  77 9 90
  81 7 70
  89 9 90
  90 6 60
  91 99.99 999
  92 11 110
  103 7 70
  118 3 30
  131 19 190
  132 6 60
  159 48 480
  160 20 200