ACCESSION: MSBNK-Fac_Eng_Univ_Tokyo-JP003288
RECORD_TITLE: N,N-DIETHYLNITROSOAMINE; EI-B; MS
DATE: 2016.01.19 (Created 2008.10.21, modified 2011.05.06)
AUTHORS: KOGA M, UNIV. OF OCCUPATIONAL AND ENVIRONMENTAL HEALTH
LICENSE: CC BY-NC-SA

CH$NAME: N,N-DIETHYLNITROSOAMINE
CH$COMPOUND_CLASS: N/A
CH$FORMULA: C4H10N2O
CH$EXACT_MASS: 102.07931
CH$SMILES: CCN(CC)N=O
CH$IUPAC: InChI=1S/C4H10N2O/c1-3-6(4-2)5-7/h3-4H2,1-2H3
CH$LINK: INCHIKEY WBNQDOYYEUMPFS-UHFFFAOYSA-N
CH$LINK: COMPTOX DTXSID2021028

AC$INSTRUMENT: VARIAN MAT-44
AC$INSTRUMENT_TYPE: EI-B
AC$MASS_SPECTROMETRY: MS_TYPE MS
AC$MASS_SPECTROMETRY: ION_MODE POSITIVE
AC$MASS_SPECTROMETRY: IONIZATION_ENERGY 70 eV

MS$FOCUSED_ION: ION_TYPE [M]+*

PK$SPLASH: splash10-0a4i-9200000000-23e0ba5d7996264681ae
PK$NUM_PEAK: 10
PK$PEAK: m/z int. rel.int.
  54 3.43 34
  55 5.48 55
  56 99.99 999
  57 99.72 997
  70 3.81 38
  71 5.66 57
  85 5.01 50
  87 3.25 33
  102 51.48 515
  103 2.78 28