ACCESSION: MSBNK-Fac_Eng_Univ_Tokyo-JP003409
RECORD_TITLE: NAPHTHALENE; EI-B; MS
DATE: 2016.01.19 (Created 2008.10.21, modified 2011.05.06)
AUTHORS: KOGA M, UNIV. OF OCCUPATIONAL AND ENVIRONMENTAL HEALTH
LICENSE: CC BY-NC-SA

CH$NAME: NAPHTHALENE
CH$COMPOUND_CLASS: N/A
CH$FORMULA: C10H8
CH$EXACT_MASS: 128.06260
CH$SMILES: c(c2)cc(c1)c(c2)ccc1
CH$IUPAC: InChI=1S/C10H8/c1-2-6-10-8-4-3-7-9(10)5-1/h1-8H
CH$LINK: INCHIKEY UFWIBTONFRDIAS-UHFFFAOYSA-N
CH$LINK: COMPTOX DTXSID8020913

AC$INSTRUMENT: JEOL JMS-01-SG-2
AC$INSTRUMENT_TYPE: EI-B
AC$MASS_SPECTROMETRY: MS_TYPE MS
AC$MASS_SPECTROMETRY: ION_MODE POSITIVE
AC$MASS_SPECTROMETRY: IONIZATION_ENERGY 75 eV

MS$FOCUSED_ION: ION_TYPE [M]+*

PK$SPLASH: splash10-004i-4900000000-10810744223497787156
PK$NUM_PEAK: 21
PK$PEAK: m/z int. rel.int.
  44 3.5 35
  50 4 40
  51 9.9 99
  52 4.4 44
  62 4.8 48
  63 7.6 76
  64 6.1 61
  67 0.44 4
  74 8.2 82
  75 5 50
  76 5.4 54
  77 0.42 4
  78 4.4 44
  86 4.2 42
  91 4.6 46
  101 0.5 5
  102 13.1 131
  126 7.6 76
  127 14.3 143
  128 99.99 999
  129 9.7 97