ACCESSION: MSBNK-Fac_Eng_Univ_Tokyo-JP003481
RECORD_TITLE: NAPHTHALENE; EI-B; MS
DATE: 2016.01.19 (Created 2008.10.21, modified 2011.05.06)
AUTHORS: MASS SPECTROSCOPY SOC. OF JAPAN (MSSJ)
LICENSE: CC BY-NC-SA

CH$NAME: NAPHTHALENE
CH$COMPOUND_CLASS: N/A
CH$FORMULA: C10H8
CH$EXACT_MASS: 128.06260
CH$SMILES: c(c2)cc(c1)c(c2)ccc1
CH$IUPAC: InChI=1S/C10H8/c1-2-6-10-8-4-3-7-9(10)5-1/h1-8H
CH$LINK: INCHIKEY UFWIBTONFRDIAS-UHFFFAOYSA-N
CH$LINK: COMPTOX DTXSID8020913

AC$INSTRUMENT: HITACHI M-60
AC$INSTRUMENT_TYPE: EI-B
AC$MASS_SPECTROMETRY: MS_TYPE MS
AC$MASS_SPECTROMETRY: ION_MODE POSITIVE
AC$MASS_SPECTROMETRY: IONIZATION_ENERGY 20 eV

MS$FOCUSED_ION: ION_TYPE [M]+*

PK$SPLASH: splash10-004i-0900000000-f640b15d5ebd285008e9
PK$NUM_PEAK: 14
PK$PEAK: m/z int. rel.int.
  57 0.32 3
  71 0.23 2
  76 0.66 7
  77 1.99 20
  78 2.09 21
  101 1.19 12
  102 6.12 61
  103 0.42 4
  125 0.11 1
  126 3.44 34
  127 11.72 117
  128 99.99 999
  129 12.36 124
  130 0.53 5