ACCESSION: MSBNK-Fac_Eng_Univ_Tokyo-JP003490
RECORD_TITLE: N-(3-HYDOXYPROPYL)MORPHOLINE; EI-B; MS
DATE: 2016.01.19 (Created 2008.10.21, modified 2011.05.06)
AUTHORS: MASS SPECTROSCOPY SOC. OF JAPAN (MSSJ)
LICENSE: CC BY-NC-SA

CH$NAME: N-(3-HYDOXYPROPYL)MORPHOLINE
CH$COMPOUND_CLASS: N/A
CH$FORMULA: C7H15NO2
CH$EXACT_MASS: 145.11028
CH$SMILES: OCCCN(C1)CCOC1
CH$IUPAC: InChI=1S/C7H15NO2/c9-5-1-2-8-3-6-10-7-4-8/h9H,1-7H2
CH$LINK: INCHIKEY VZKSLWJLGAGPIU-UHFFFAOYSA-N
CH$LINK: COMPTOX DTXSID10196160

AC$INSTRUMENT: HITACHI M-60
AC$INSTRUMENT_TYPE: EI-B
AC$MASS_SPECTROMETRY: MS_TYPE MS
AC$MASS_SPECTROMETRY: ION_MODE POSITIVE
AC$MASS_SPECTROMETRY: IONIZATION_ENERGY 20 eV

MS$FOCUSED_ION: ION_TYPE [M]+*

PK$SPLASH: splash10-0udl-9700000000-8f5b1f6081a118c34126
PK$NUM_PEAK: 17
PK$PEAK: m/z int. rel.int.
  41 8.84 88
  42 31.21 312
  43 47.86 479
  44 4.51 45
  54 1.95 20
  55 3.75 38
  56 19.32 193
  57 10.61 106
  70 4.33 43
  71 1.84 18
  84 1.68 17
  86 1.7 17
  87 0.87 9
  98 1.03 10
  100 99.99 999
  101 6.71 67
  145 5.65 57