ACCESSION: MSBNK-Fac_Eng_Univ_Tokyo-JP003492
RECORD_TITLE: 3-(1-METHYL-2-PYRROLIDINYL)PYRIDINE; EI-B; MS
DATE: 2016.01.19 (Created 2008.10.21, modified 2011.05.06)
AUTHORS: MASS SPECTROSCOPY SOC. OF JAPAN (MSSJ)
LICENSE: CC BY-NC-SA

CH$NAME: 3-(1-METHYL-2-PYRROLIDINYL)PYRIDINE
CH$COMPOUND_CLASS: N/A
CH$FORMULA: C10H14N2
CH$EXACT_MASS: 162.11570
CH$SMILES: CN(C2)C(CC2)c(c1)cncc1
CH$IUPAC: InChI=1S/C10H14N2/c1-12-7-3-5-10(12)9-4-2-6-11-8-9/h2,4,6,8,10H,3,5,7H2,1H3
CH$LINK: INCHIKEY SNICXCGAKADSCV-UHFFFAOYSA-N
CH$LINK: COMPTOX DTXSID3048154

AC$INSTRUMENT: HITACHI M-60
AC$INSTRUMENT_TYPE: EI-B
AC$MASS_SPECTROMETRY: MS_TYPE MS
AC$MASS_SPECTROMETRY: ION_MODE POSITIVE
AC$MASS_SPECTROMETRY: IONIZATION_ENERGY 20 eV

MS$FOCUSED_ION: ION_TYPE [M]+*

PK$SPLASH: splash10-001i-9800000000-e2da519a4fcd1232adad
PK$NUM_PEAK: 56
PK$PEAK: m/z int. rel.int.
  41 0.89 9
  42 10.32 103
  43 6 60
  44 1.95 20
  53 0.12 1
  55 4.18 42
  56 0.53 5
  57 0.86 9
  58 0.33 3
  65 1.25 13
  66 0.15 2
  67 0.14 1
  68 0.36 4
  69 0.33 3
  70 0.14 1
  77 0.41 4
  78 1.2 12
  79 0.78 8
  80 1.11 11
  81 1.17 12
  82 3.63 36
  83 1.48 15
  84 99.99 999
  85 11.31 113
  86 0.22 2
  91 0.87 9
  92 5.07 51
  93 1.33 13
  94 0.3 3
  103 0.22 2
  104 0.93 9
  105 2.03 20
  106 1.57 16
  107 0.99 10
  117 2.02 20
  118 4.42 44
  119 9.54 95
  120 3.41 34
  121 0.57 6
  130 3.75 38
  131 0.9 9
  132 2.06 21
  133 38.36 384
  134 5.58 56
  135 0.36 4
  144 0.25 3
  145 0.45 5
  146 0.24 2
  147 0.69 7
  158 0.12 1
  159 1.14 11
  160 0.91 9
  161 24.46 245
  162 31.69 317
  163 4.13 41
  164 0.22 2