ACCESSION: MSBNK-Fac_Eng_Univ_Tokyo-JP003617
RECORD_TITLE: BIPHENYL; EI-B; MS
DATE: 2016.01.19 (Created 2008.10.21, modified 2011.05.06)
AUTHORS: MASS SPECTROSCOPY SOC. OF JAPAN (MSSJ)
LICENSE: CC BY-NC-SA

CH$NAME: BIPHENYL
CH$COMPOUND_CLASS: N/A
CH$FORMULA: C12H10
CH$EXACT_MASS: 154.07825
CH$SMILES: c(c2)ccc(c2)c(c1)cccc1
CH$IUPAC: InChI=1S/C12H10/c1-3-7-11(8-4-1)12-9-5-2-6-10-12/h1-10H
CH$LINK: INCHIKEY ZUOUZKKEUPVFJK-UHFFFAOYSA-N
CH$LINK: COMPTOX DTXSID4020161

AC$INSTRUMENT: Unknown
AC$INSTRUMENT_TYPE: EI-B
AC$MASS_SPECTROMETRY: MS_TYPE MS
AC$MASS_SPECTROMETRY: ION_MODE POSITIVE

MS$FOCUSED_ION: ION_TYPE [M]+*

PK$SPLASH: splash10-0udi-3900000000-11fa850b6e97cb680edd
PK$NUM_PEAK: 20
PK$PEAK: m/z int. rel.int.
  39 6 60
  50 7.8 78
  51 11 110
  52 0.31 3
  62 2.5 25
  63 7.1 71
  64 7.2 72
  74 0.45 5
  75 5 50
  76 17.5 175
  77 10 100
  115 0.55 6
  126 3 30
  127 2.8 28
  128 4 40
  151 0.84 8
  152 20.5 205
  153 26.3 263
  154 99.99 999
  155 12.8 128