ACCESSION: MSBNK-Fac_Eng_Univ_Tokyo-JP003647
RECORD_TITLE: RESORCINOL; EI-B; MS
DATE: 2016.01.19 (Created 2008.10.21, modified 2011.05.06)
AUTHORS: MASS SPECTROSCOPY SOC. OF JAPAN (MSSJ)
LICENSE: CC BY-NC-SA

CH$NAME: RESORCINOL
CH$COMPOUND_CLASS: N/A
CH$FORMULA: C6H6O2
CH$EXACT_MASS: 110.03678
CH$SMILES: Oc(c1)cc(O)cc1
CH$IUPAC: InChI=1S/C6H6O2/c7-5-2-1-3-6(8)4-5/h1-4,7-8H
CH$LINK: INCHIKEY GHMLBKRAJCXXBS-UHFFFAOYSA-N
CH$LINK: COMPTOX DTXSID2021238

AC$INSTRUMENT: Unknown
AC$INSTRUMENT_TYPE: EI-B
AC$MASS_SPECTROMETRY: MS_TYPE MS
AC$MASS_SPECTROMETRY: ION_MODE POSITIVE

MS$FOCUSED_ION: ION_TYPE [M]+*

PK$SPLASH: splash10-03di-9500000000-02f0a9b7ce8b4af47473
PK$NUM_PEAK: 29
PK$PEAK: m/z int. rel.int.
  38 12 120
  39 22 220
  40 3.9 39
  41 0.43 4
  42 7.8 78
  43 5.1 51
  49 3 30
  50 0.67 7
  51 8.5 85
  52 4.8 48
  53 19.2 192
  54 0.71 7
  55 18.3 183
  61 3.5 35
  62 4.3 43
  63 0.97 10
  64 7.6 76
  65 2.5 25
  66 2.1 21
  68 0.3 3
  69 10.7 107
  71 2.8 28
  81 22.6 226
  82 1.65 17
  92 2 20
  95 2.5 25
  109 2 20
  110 99.99 999
  111 6 60