ACCESSION: MSBNK-Fac_Eng_Univ_Tokyo-JP003692
RECORD_TITLE: TRIPROPYL BORATE; EI-B; MS
DATE: 2016.01.19 (Created 2008.10.21, modified 2011.05.06)
AUTHORS: SASAKI S, TOYOHASHI UNIV. OF TECH.
LICENSE: CC BY-NC-SA

CH$NAME: TRIPROPYL BORATE
CH$COMPOUND_CLASS: N/A
CH$FORMULA: C9H21BO3
CH$EXACT_MASS: 188.15838
CH$SMILES: CCCO[B](OCCC)OCCC
CH$IUPAC: InChI=1S/C9H21BO3/c1-4-7-11-10(12-8-5-2)13-9-6-3/h4-9H2,1-3H3
CH$LINK: INCHIKEY LTEHWCSSIHAVOQ-UHFFFAOYSA-N
CH$LINK: COMPTOX DTXSID4060995

AC$INSTRUMENT: Unknown
AC$INSTRUMENT_TYPE: EI-B
AC$MASS_SPECTROMETRY: MS_TYPE MS
AC$MASS_SPECTROMETRY: ION_MODE POSITIVE

MS$FOCUSED_ION: ION_TYPE [M]+*

PK$SPLASH: splash10-0006-9300000000-936ea926ed30393712ce
PK$NUM_PEAK: 27
PK$PEAK: m/z int. rel.int.
  27 18 180
  28 6 60
  29 7 70
  31 1.5 15
  39 8 80
  41 31 310
  42 11 110
  43 99.99 999
  44 13 130
  45 49 490
  55 5 50
  56 0.06 1
  57 7 70
  58 8 80
  59 12 120
  87 0.84 8
  101 10 100
  103 23 230
  104 3 30
  117 0.51 5
  129 27 270
  145 13 130
  146 6 60
  159 0.38 4
  173 14 140
  187 6 60
  188 11 110