ACCESSION: MSBNK-Fac_Eng_Univ_Tokyo-JP003716
RECORD_TITLE: O-HEXYLHYDROXYLAMINE; EI-B; MS
DATE: 2016.01.19 (Created 2008.10.21, modified 2011.05.06)
AUTHORS: SASAKI S, TOYOHASHI UNIV. OF TECH.
LICENSE: CC BY-NC-SA

CH$NAME: O-HEXYLHYDROXYLAMINE
CH$COMPOUND_CLASS: N/A
CH$FORMULA: C6H15NO
CH$EXACT_MASS: 117.11536
CH$SMILES: CCCCCCON
CH$IUPAC: InChI=1S/C6H15NO/c1-2-3-4-5-6-8-7/h2-7H2,1H3
CH$LINK: INCHIKEY AIPBDRLFQKUETL-UHFFFAOYSA-N
CH$LINK: COMPTOX DTXSID30556929

AC$INSTRUMENT: Unknown
AC$INSTRUMENT_TYPE: EI-B
AC$MASS_SPECTROMETRY: MS_TYPE MS
AC$MASS_SPECTROMETRY: ION_MODE POSITIVE

MS$FOCUSED_ION: ION_TYPE [M]+*

PK$SPLASH: splash10-0006-9000000000-7ae25fd90220fb3fdbe0
PK$NUM_PEAK: 29
PK$PEAK: m/z int. rel.int.
  38 3.2 32
  39 7.6 76
  40 1.4 14
  41 2.7 27
  42 12.9 129
  43 99.99 999
  44 8.6 86
  45 0.19 2
  46 3.5 35
  53 1.4 14
  54 1.4 14
  55 1.59 16
  56 18.9 189
  57 14.9 149
  58 1.4 14
  67 0.11 1
  69 5.4 54
  70 2.4 24
  71 2.7 27
  72 0.14 1
  79 2.2 22
  80 6.2 62
  81 2.2 22
  82 0.59 6
  84 4.9 49
  85 14.9 149
  86 1.1 11
  91 0.16 2
  117 0.7 7