ACCESSION: MSBNK-Fac_Eng_Univ_Tokyo-JP003718
RECORD_TITLE: O-BENZYLHYDROXYLAMINE; EI-B; MS
DATE: 2016.01.19 (Created 2008.10.21, modified 2011.05.06)
AUTHORS: SASAKI S, TOYOHASHI UNIV. OF TECH.
LICENSE: CC BY-NC-SA

CH$NAME: O-BENZYLHYDROXYLAMINE
CH$COMPOUND_CLASS: N/A
CH$FORMULA: C7H9NO
CH$EXACT_MASS: 123.06841
CH$SMILES: NOCc(c1)cccc1
CH$IUPAC: InChI=1S/C7H9NO/c8-9-6-7-4-2-1-3-5-7/h1-5H,6,8H2
CH$LINK: INCHIKEY XYEOALKITRFCJJ-UHFFFAOYSA-N
CH$LINK: COMPTOX DTXSID8073213

AC$INSTRUMENT: Unknown
AC$INSTRUMENT_TYPE: EI-B
AC$MASS_SPECTROMETRY: MS_TYPE MS
AC$MASS_SPECTROMETRY: ION_MODE POSITIVE

MS$FOCUSED_ION: ION_TYPE [M]+*

PK$SPLASH: splash10-0006-9200000000-d0f55e2c77e6f11b4314
PK$NUM_PEAK: 31
PK$PEAK: m/z int. rel.int.
  39 7 70
  41 3.5 35
  42 1.8 18
  43 0.65 7
  44 2 20
  50 6.5 65
  51 13 130
  52 0.35 4
  53 1.5 15
  55 1.5 15
  63 2.5 25
  65 1.05 11
  70 1.5 15
  71 1.5 15
  74 2 20
  75 0.15 2
  76 2 20
  77 24.5 245
  78 5 50
  79 0.12 1
  89 2.5 25
  90 2 20
  91 99.99 999
  92 0.1 1
  93 2 20
  103 4 40
  105 16.5 165
  106 0.16 2
  107 11 110
  108 14 140
  123 1 10