ACCESSION: MSBNK-Fac_Eng_Univ_Tokyo-JP003970
RECORD_TITLE: 2,8-DITRIMETHYLSILYLOXY-4-QUINOLINECARBOXYLIC ACID TRIMETHYLSILYL ESTER; CI-B; MS
DATE: 2016.01.19 (Created 2008.10.21, modified 2011.05.06)
AUTHORS: MASS SPECTROSCOPY SOC. OF JAPAN (MSSJ)
LICENSE: CC BY-NC-SA

CH$NAME: 2,8-DITRIMETHYLSILYLOXY-4-QUINOLINECARBOXYLIC ACID TRIMETHYLSILYL ESTER
CH$COMPOUND_CLASS: N/A
CH$FORMULA: C19H31NO4Si3
CH$EXACT_MASS: 421.15609
CH$SMILES: C[Si](C)(C)OC(=O)c(c2)c(c1)c(nc(O[Si](C)(C)C)2)c(cc1)O[Si](C)(C)C
CH$IUPAC: InChI=1S/C19H31NO4Si3/c1-25(2,3)22-16-12-10-11-14-15(19(21)24-27(7,8)9)13-17(20-18(14)16)23-26(4,5)6/h10-13H,1-9H3
CH$LINK: INCHIKEY SKPPDKJSRKVMFU-UHFFFAOYSA-N

AC$INSTRUMENT: HITACHI M-60
AC$INSTRUMENT_TYPE: CI-B
AC$MASS_SPECTROMETRY: MS_TYPE MS
AC$MASS_SPECTROMETRY: ION_MODE POSITIVE
AC$MASS_SPECTROMETRY: IONIZATION_ENERGY 100 eV
AC$MASS_SPECTROMETRY: REAGENT_GAS ISOBUTANE

PK$SPLASH: splash10-00di-1002900000-289292ea8047e2479638
PK$NUM_PEAK: 65
PK$PEAK: m/z int. rel.int.
  61 0.12 1
  68 0.23 2
  70 0.46 5
  71 1.14 11
  73 20.14 201
  74 1.87 19
  75 1.62 16
  86 0.43 4
  91 0.35 4
  107 0.15 2
  147 0.7 7
  188 0.22 2
  216 1.53 15
  217 0.24 2
  244 0.36 4
  262 10.11 101
  274 0.31 3
  278 0.1 1
  288 0.3 3
  289 1.19 12
  290 1.36 14
  291 0.99 10
  292 0.23 2
  301 0.43 4
  302 1.46 15
  304 1.67 17
  305 1.19 12
  306 2.72 27
  330 0.17 2
  331 0.36 4
  332 10.67 107
  333 2.59 26
  334 4.37 44
  335 1.01 10
  336 0.53 5
  346 0.16 2
  348 0.4 4
  349 5.06 51
  351 2.1 21
  352 1.47 15
  353 0.2 2
  359 0.43 4
  361 0.62 6
  362 0.13 1
  363 0.85 9
  372 3.1 31
  374 5.19 52
  376 3.33 33
  377 0.14 1
  392 9.48 95
  395 0.95 10
  396 0.52 5
  398 0.2 2
  399 0.74 7
  408 33.66 337
  409 16.5 165
  410 3.7 37
  411 1.28 13
  412 0.43 4
  417 0.16 2
  422 99.99 999
  424 32.48 325
  425 15.94 159
  426 3.93 39
  427 1.47 15