ACCESSION: MSBNK-Fac_Eng_Univ_Tokyo-JP003993
RECORD_TITLE: ETHYLENEDIAMINE; EI-B; MS
DATE: 2016.01.19 (Created 2008.10.21, modified 2011.05.06)
AUTHORS: MASS SPECTROSCOPY SOC. OF JAPAN (MSSJ)
LICENSE: CC BY-NC-SA

CH$NAME: ETHYLENEDIAMINE
CH$COMPOUND_CLASS: N/A
CH$FORMULA: C2H8N2
CH$EXACT_MASS: 60.06875
CH$SMILES: NCCN
CH$IUPAC: InChI=1S/C2H8N2/c3-1-2-4/h1-4H2
CH$LINK: INCHIKEY PIICEJLVQHRZGT-UHFFFAOYSA-N
CH$LINK: COMPTOX DTXSID5021881

AC$INSTRUMENT: HITACHI RMU-6L
AC$INSTRUMENT_TYPE: EI-B
AC$MASS_SPECTROMETRY: MS_TYPE MS
AC$MASS_SPECTROMETRY: ION_MODE POSITIVE
AC$MASS_SPECTROMETRY: IONIZATION_ENERGY 70 eV

MS$FOCUSED_ION: ION_TYPE [M]+*

PK$SPLASH: splash10-001i-9000000000-7161cac69670b52ad6d8
PK$NUM_PEAK: 20
PK$PEAK: m/z int. rel.int.
  14 1.5 15
  15 3.4 34
  16 1.2 12
  17 0.31 3
  18 12 120
  26 1.2 12
  27 4.6 46
  28 0.2 2
  29 4.5 45
  30 99.99 999
  31 3.3 33
  40 0.16 2
  41 2 20
  42 6 60
  43 5.3 53
  44 0.41 4
  45 1.5 15
  58 1 10
  59 1 10
  60 2.7 27