ACCESSION: MSBNK-Fac_Eng_Univ_Tokyo-JP004054
RECORD_TITLE: 1,2-DIMETHOXYBENZENE; EI-B; MS
DATE: 2016.01.19 (Created 2008.10.21, modified 2011.05.06)
AUTHORS: MASS SPECTROSCOPY SOC. OF JAPAN (MSSJ)
LICENSE: CC BY-NC-SA

CH$NAME: 1,2-DIMETHOXYBENZENE
CH$COMPOUND_CLASS: N/A
CH$FORMULA: C8H10O2
CH$EXACT_MASS: 138.06808
CH$SMILES: COc(c1)c(OC)ccc1
CH$IUPAC: InChI=1S/C8H10O2/c1-9-7-5-3-4-6-8(7)10-2/h3-6H,1-2H3
CH$LINK: INCHIKEY ABDKAPXRBAPSQN-UHFFFAOYSA-N
CH$LINK: COMPTOX DTXSID7047065

AC$INSTRUMENT: HITACHI RMU-6L
AC$INSTRUMENT_TYPE: EI-B
AC$MASS_SPECTROMETRY: MS_TYPE MS
AC$MASS_SPECTROMETRY: ION_MODE POSITIVE
AC$MASS_SPECTROMETRY: IONIZATION_ENERGY 70 eV

MS$FOCUSED_ION: ION_TYPE [M]+*

PK$SPLASH: splash10-000j-9500000000-ba3df3a0cec54fd4ddb1
PK$NUM_PEAK: 49
PK$PEAK: m/z int. rel.int.
  26 10.5 105
  27 3.2 32
  28 2.6 26
  29 0.95 10
  30 2.1 21
  31 3.6 36
  37 3.5 35
  38 0.85 9
  39 14.2 142
  40 2.4 24
  41 22.1 221
  42 0.26 3
  49 2.1 21
  50 14.7 147
  51 4.7 47
  52 3.42 34
  53 7.5 75
  54 3 30
  55 4.1 41
  61 0.19 2
  62 4.8 48
  63 4.8 48
  64 9.4 94
  65 2.26 23
  66 3 30
  67 9.2 92
  73 2.1 21
  74 0.32 3
  75 2 20
  76 2.5 25
  77 36 360
  78 0.41 4
  79 3.8 38
  80 11.8 118
  81 6 60
  92 0.59 6
  93 5.5 55
  94 2.2 22
  95 61.7 617
  96 0.5 5
  107 2 20
  109 2 20
  110 1.8 18
  121 0.26 3
  122 3.5 35
  123 41.3 413
  124 3.2 32
  138 99.99 999
  139 8.3 83